program: Gaussian 09
title: 000290499
version: EM64L-G09RevD.01
frameworkgroup: C1[X(C9H11NO2S)]
method: RPBEPBE
basis: SDD
operation: Freq
keyword: #p
keyword: freq=noraman
keyword: PBEPBE/SDD
title: #p freq=noraman PBEPBE/SDD
converged: YES YES NO NO
title: Mulliken charges:
elementType: S O O N C C C C C C C C C H H H H H H H H H H H
charge: 0.137450 -0.413618 -0.230852 -0.676259 -0.643404 -0.344626 -0.435790 0.499102 -0.227367 -0.391014 -0.266387 -0.197859 0.193624 0.282529 0.281673 0.258673 0.265218 0.246948 0.217598 0.228012 0.222258 0.302398 0.312967 0.378724
chargesum: 0.00000
title: Mulliken charges with hydrogens summed into heavy atoms:
elementType: S O O N C C C C C C C C C
charge: 0.137450 -0.034894 -0.230852 -0.060894 -0.079202 -0.344626 0.088101 0.499102 0.019581 -0.173415 -0.038375 0.024400 0.193624
polarizability: 1.70338399e+02 -7.24047128e+00 1.18829171e+02 2.14094994e+01 1.14138861e+00 9.45981915e+01
1716.lowfreq: -6.8502 -4.3749 -0.0028 -0.0021 0.0013 6.1900 14.9337 18.7655 45.2052
frequency: 14.5373 18.2760 45.1469 67.7229 81.4356 136.6540 175.5642 226.5282 253.9742 276.0612 370.3621 385.9934 425.8711 448.9822 470.6413 505.7332 537.0458 548.2773 555.3918 564.1672 638.4566 662.3903 699.7527 732.6264 754.3695 775.5907 827.8640 846.5535 870.5006 939.9600 971.0232 979.8146 1000.1284 1031.4288 1036.5655 1043.7098 1087.8308 1133.7153 1135.6048 1169.9995 1227.8581 1260.9794 1264.9231 1269.6107 1322.6033 1358.0837 1382.9353 1441.5022 1442.7368 1462.1952 1481.9161 1572.1607 1596.2884 1624.0661 1667.6658 2999.5982 3047.8021 3050.9176 3118.0323 3124.7882 3136.4726 3144.9965 3168.5169 3509.6643 3514.5336 3679.2769
redmass: 9.6115 5.3305 6.6188 1.9265 3.5382 5.1913 4.9143 8.3062 6.1299 4.3587 5.6494 1.1673 4.0005 3.4901 3.7455 1.8083 1.6460 6.5272 1.9414 3.9057 1.3286 6.5867 5.6217 2.7741 1.4515 1.2783 5.2058 1.4945 4.2221 1.3678 1.3189 1.5088 2.8079 3.2347 2.2628 2.0683 2.4603 1.2247 1.3229 1.0549 1.2627 1.1887 1.5603 1.5324 1.9074 1.9595 7.4790 2.3956 1.1215 1.1121 2.8945 6.3175 1.6489 2.5890 8.2908 1.0611 1.0596 1.0963 1.0865 1.1091 1.0886 1.0943 1.1001 1.0477 1.0640 1.1006
irintensity: 1.3304 0.1903 0.6360 0.1284 1.6487 1.0999 0.4097 1.5942 3.6771 19.0237 3.0566 156.3363 19.0070 15.1543 18.4141 29.7562 40.2662 0.4102 72.5181 10.7217 130.1274 6.4757 7.6240 6.2481 94.2818 13.5938 5.6770 4.0010 1.9372 2.4399 0.2048 1.5543 5.1796 254.1958 16.5551 34.2337 44.1050 0.2314 12.2887 6.0080 6.5583 1.1531 10.2305 6.9315 16.0812 116.6446 17.5708 8.9646 31.2237 7.0419 72.6784 4.9027 23.6528 240.7342 194.1115 15.6478 7.7368 3.0416 9.8879 8.1638 5.8275 26.6797 23.4157 48.8860 23.3483 40.7882
temp: 298.150 k
press: 1.00000 atm
elementType: 16 8 8 7 6 6 6 6 6 6 6 6 6 1 1 1 1 1 1 1 1 1 1 1
symmnumber: 1
zpe: 486379.9 jmol-1
zpe.correction: 0.185252 hartree
zpe.thermalcorrener: 0.198790 hartree
zpe.thermalcorrenthalpy: 0.199734 hartree
zpe.thermalcorrgfe: 0.141593 hartree
zpe.sumelectzpe: -951.863165 hartree
zpe.sumelectthermal: -951.849628 hartree
zpe.sumelectthermalent: -951.848684 hartree
zpe.sumelectthermalfe: -951.906824 hartree
dipole: -0.6102 1.7372 -0.1405
dipole: 1.8466
quadrupole: -71.5947 -72.2939 -93.5436
quadrupole: 2.8999 5.0707 -0.8254
quadrupole: 7.5494 6.8502 -14.3996 2.8999 5.0707 -0.8254
hfenergy: -952.0484176 hartree
pointgroup: C01 [X(C9H11N1O2S1)]
dipole: 0.1673582 -0.6402304 0.299864 debye
dipolederiv: -0.1794854 0.023803 -0.016079 -0.0638661 -0.1598927 0.0981453 -0.0579594 0.111732 -0.0021969 -1.3784923 0.2594139 0.2797357 0.2186551 -0.4547092 0.0005912 0.1915416 0.0117756 -0.3504136 -0.758492 0.0195315 -0.077115 0.1119285 -0.4343735 -0.2425019 0.1040813 -0.2701447 -0.7944719 -0.4898264 0.2749292 -0.3249825 0.1625873 -1.1894442 0.1689634 -0.3068248 0.2426973 -0.5265776 0.2147102 0.0749045 0.1646899 0.1419509 0.0891113 -0.0308566 0.2822159 -0.032719 0.0818443 0.2952531 -0.2556209 -0.1189989 0.1093021 -0.2616248 -0.0498304 -0.2812335 0.1823296 -0.1752499 -0.1721024 0.002252 -0.0770778 -0.2251554 0.0833651 -0.1566481 -0.4686859 -0.1116542 -0.1601949 0.0412524 -0.4022488 0.2585616 -0.1670517 1.1057148 -0.358795 0.2104469 -0.2934583 0.1438018 0.0421701 -0.0059847 -0.122147 -0.2868794 0.1001817 0.0270133 0.0535435 -0.1141913 -0.0149912 -0.1160747 0.312274 -0.2454314 -0.0916078 -0.290745 0.0705502 -0.0335323 -0.2064695 -0.0724505 -0.3525108 -0.0664334 0.0762445 -0.0228285 -0.1079927 -0.0511541 0.0924396 -0.0185986 -0.2446879 0.0722543 -0.0942103 -0.1004363 0.0883573 0.1666026 -0.1897082 -0.1941203 -0.1095235 0.0700655 1.7298227 -0.2189697 -0.0492007 -0.1985586 0.4405473 0.4252411 -0.0220967 0.4255592 1.0143873 0.0074023 0.0024634 -0.0431345 -0.0138586 -0.0762143 -0.0304425 -0.0378002 -0.0314064 0.0442553 0.0243367 -0.038228 0.0009295 -0.0088906 0.0458394 0.0368126 0.0008229 0.0229806 -0.0713656 0.0959086 -0.0078991 -0.0251388 0.0588994 -0.0575023 -0.0116866 0.0242579 -0.0074028 0.1092866 0.0693692 -0.0230829 0.0136475 -0.0136442 0.087417 0.0676221 0.0920246 0.0472952 -0.0053917 0.0793932 -0.0530606 0.0937051 -0.0374999 0.0657061 0.0612396 0.0780831 0.0747612 0.0393538 0.0314412 -0.0145521 0.0929347 -0.039815 0.0104721 0.1206894 0.122648 0.1070452 0.0263676 0.0562965 0.0905736 0.0195825 0.1087763 -0.0633326 0.0838624 0.0216609 0.0850653 0.1105082 -0.0664077 0.0859484 0.0976159 0.0860068 0.0773887 -0.0126891 0.1097152 -0.0160532 0.0851303 0.1783687 0.0120316 0.1209853 0.0383834 0.2361762 0.0456721 0.1154113 0.0249549 0.2690289 0.290412 0.0452348 0.05341 0.0899449 0.2427334 0.029603 0.020809 -0.0281946 0.2557228 0.2850005 -0.0230694 -0.0723 -0.0451362 0.3445756 -0.1016931 -0.1174486 -0.09638 0.1682392 unknown
polarizability: 167.8785887|-21.7145827|115.5584723|-13.0618439|-10.5225636|100.3287006 unknown
InChI: InChI=1S/C9H11NO2S/c10-7-3-1-2-4-8(7)13-6-5-9(11)12/h1-4,11H,5-6,10H2
charge 0 multiplicity 1
24 atoms
S  0.164541 -0.606535 -1.438291
O  5.134816 -0.513088 0.067602
O  3.679826 0.449766 1.601676
N  -1.601037 -1.968258 0.682223
C  1.402672 -0.041408 -0.096517
C  -1.393195 0.051465 -0.694355
C  2.803184 -0.507616 -0.513379
C  -2.091049 -0.729379 0.282983
C  -1.896778 1.302436 -1.107552
C  -3.293539 -0.194491 0.83579
C  -3.091596 1.819097 -0.556847
C  -3.779368 1.059994 0.420872
C  3.859425 -0.125364 0.506929
H  1.341461 1.055225 -0.026334
H  1.093872 -0.477162 0.86649
H  2.837041 -1.606837 -0.644316
H  3.093712 -0.077716 -1.490776
H  -1.343508 1.867625 -1.865313
H  -3.840866 -0.775682 1.588106
H  -3.475345 2.790917 -0.882236
H  -4.706019 1.44679 0.860746
H  -2.115057 -2.543144 1.343054
H  -0.812511 -2.365805 0.170857
H  5.81022 -0.256227 0.752789
