program: Gaussian 09
title: 000290492
version: EM64L-G09RevD.01
frameworkgroup: C1[X(C7H16Cl3N2O2P)]
method: RPBEPBE
basis: SDD
operation: Freq
keyword: #p
keyword: freq=noraman
keyword: PBEPBE/SDD
title: #p freq=noraman PBEPBE/SDD
converged: YES YES NO NO
title: Mulliken charges:
elementType: Cl Cl Cl P O O N N C C C C C C C H H H H H H H H H H H H H H H H
charge: -0.069662 -0.060691 -0.087604 1.383757 -0.542866 -0.611853 -0.532263 -0.932802 -0.266743 -0.325715 -0.247306 -0.574899 -0.555770 -0.350429 -0.569518 0.239235 0.250883 0.245830 0.265645 0.248516 0.234302 0.299451 0.266200 0.261862 0.299563 0.233221 0.222088 0.350035 0.363348 0.273376 0.290806
chargesum: 0.00000
title: Mulliken charges with hydrogens summed into heavy atoms:
elementType: Cl Cl Cl P O O N N C C C C C C C
charge: -0.069662 -0.060691 -0.087604 1.383757 -0.542866 -0.611853 -0.532263 -0.219419 0.223375 0.185760 0.235513 -0.009247 0.005656 0.104880 -0.005335
polarizability: 1.84632595e+02 -5.92916362e+00 1.40467103e+02 1.92885639e+00 -4.24035865e+00 1.16027531e+02
1716.lowfreq: -23.2270 -12.6358 -5.7861 -2.1111 -0.0024 -0.0017 -0.0004 20.1156 33.4641
frequency: -21.7821 19.9641 33.3969 34.2863 37.1965 59.0784 64.4667 89.8135 103.9940 109.4313 162.0426 175.3413 200.9479 206.3339 214.5529 222.4449 242.9872 280.0691 296.7163 332.8919 366.6494 394.3849 416.7329 444.8569 448.9560 497.2573 512.2648 590.2651 620.7570 665.5710 686.2878 703.8630 774.8035 783.3147 794.6587 841.6277 871.9517 913.8345 926.5664 956.8072 998.2957 1000.8985 1032.4446 1035.0166 1048.6120 1057.0988 1067.5734 1104.3103 1112.1972 1143.4989 1198.5974 1203.5654 1234.3515 1256.0773 1258.0374 1274.6084 1290.6917 1300.2358 1322.7845 1349.4280 1360.7391 1364.8805 1371.4447 1432.0553 1443.7662 1452.5461 1456.4433 1459.4530 1463.1000 1473.4650 1557.9646 2985.6592 3005.0339 3014.9802 3020.8037 3047.8631 3057.6214 3064.9866 3070.8745 3079.8339 3084.2111 3084.6883 3144.7917 3153.3875 3159.3628 3534.3791 3684.0741
redmass: 5.8840 9.9842 8.9832 7.2683 9.4060 7.3734 4.4587 2.4521 6.4006 2.3998 3.4674 3.6359 5.8276 5.5367 6.1141 3.9003 3.9857 3.1229 3.1704 2.6669 2.2095 2.1294 2.4522 3.9833 2.9907 4.1862 1.4432 4.0308 5.0803 6.5440 5.3053 4.2597 1.1526 1.1788 1.7180 5.0025 3.1807 2.8510 1.8577 2.4916 1.5145 1.9852 2.0698 1.8277 2.3821 4.0429 2.7393 2.1751 1.5803 1.2132 1.2470 2.1305 1.6515 1.1628 1.1576 1.1478 1.1627 1.1560 1.1992 1.2254 1.2707 1.5551 1.2217 1.0871 1.0933 1.0850 1.0870 1.0800 1.0884 1.0771 1.1027 1.0613 1.0592 1.0608 1.0608 1.0965 1.0568 1.0592 1.0598 1.1011 1.1073 1.1045 1.1122 1.1109 1.1124 1.0444 1.1028
irintensity: 1.9710 1.4203 0.7034 1.7815 3.0262 0.6338 3.9588 2.3025 1.6228 2.5198 2.1681 11.2000 5.7961 3.0078 2.1377 4.1563 24.7711 8.4960 5.9933 11.2492 0.9572 19.3563 23.9990 12.7879 7.1496 15.0950 242.9367 9.0586 40.8883 63.1024 58.3006 272.4496 1.8471 17.0784 13.5568 102.8842 124.1141 149.3880 47.5880 60.7233 24.1296 67.9649 2.8531 5.4045 15.3195 75.1783 77.6124 9.1864 58.6411 3.0969 0.4821 65.7614 11.1420 15.7023 4.9080 9.6133 8.6145 16.0630 11.4441 0.7266 0.5206 2.9091 6.0152 17.7346 0.6732 15.2030 9.9369 9.3037 27.8823 12.2212 64.6655 13.9033 23.6634 17.1596 12.5255 19.6304 11.8268 12.0060 16.3345 11.6512 11.4557 3.6016 9.4182 9.7998 10.4634 50.7158 45.2452
temp: 298.150 k
press: 1.00000 atm
elementType: 17 17 17 15 8 8 7 7 6 6 6 6 6 6 6 1 1 1 1 1 1 1 1 1 1 1 1 1 1 1 1
symmnumber: 1
zpe: 630516.3 jmol-1
zpe.correction: 0.240151 hartree
zpe.thermalcorrener: 0.259060 hartree
zpe.thermalcorrenthalpy: 0.260005 hartree
zpe.thermalcorrgfe: 0.189136 hartree
zpe.sumelectzpe: -2256.465165 hartree
zpe.sumelectthermal: -2256.446256 hartree
zpe.sumelectthermalent: -2256.445312 hartree
zpe.sumelectthermalfe: -2256.516180 hartree
dipole: 0.2173 -0.9423 1.6731
dipole: 1.9325
quadrupole: -147.0966 -125.0154 -112.1800
quadrupole: 5.8233 11.9660 -8.0873
quadrupole: -18.9993 3.0819 15.9173 5.8233 11.9660 -8.0873
hfenergy: -2256.7053162 hartree
pointgroup: C01 [X(C7H16Cl3N2O2P1)]
dipole: -0.1472341 -0.2819228 -0.6905652 debye
polarizability: 179.9338604|14.5090215|142.2313904|-8.7206686|5.7124419|118.9619775 unknown
InChI: InChI=1S/C7H16Cl3N2O2P/c8-2-1-7-14-15(11,13)12(5-3-9)6-4-10/h1-7,11H2
charge 0 multiplicity 1
31 atoms
Cl 0.67324 3.681466 0.257924
Cl -5.10041 -0.73581 0.992905
Cl 4.939298 0.695201 -1.467604
P  -0.263845 -1.410373 -0.554847
O  1.262541 -0.6010 -0.796285
O  -0.188678 -2.595846 0.516428
N  -1.211998 0.0290 -0.268482
N  -0.875327 -1.991241 -2.047595
C  -0.614495 1.200424 0.418077
C  -2.690138 -0.09335 -0.275801
C  2.515879 -1.362366 -0.515565
C  -0.173285 2.234401 -0.627047
C  -3.210997 -0.694991 1.043532
C  3.357398 -0.578194 0.496535
C  3.772125 0.816363 0.027855
H  -1.357973 1.643083 1.105694
H  0.257847 0.901545 1.023402
H  -3.125604 0.909195 -0.435299
H  -3.002946 -0.73128 -1.120266
H  2.26078 -2.360293 -0.111931
H  3.044388 -1.459953 -1.479348
H  0.579088 1.811969 -1.306647
H  -1.017228 2.671898 -1.180701
H  -2.948527 -0.08549 1.921313
H  -2.881421 -1.73509 1.183529
H  4.259355 -1.172632 0.73908
H  2.777986 -0.467953 1.43571
H  -0.956196 -1.392303 -2.868243
H  -0.945784 -2.99867 -2.184598
H  4.348943 1.35997 0.789911
H  2.922385 1.42052 -0.318737
