program: Gaussian 09
title: 000290477
version: EM64L-G09RevD.01
frameworkgroup: C1[X(C16H17N3O4)]
method: RPBEPBE
basis: SDD
operation: Freq
keyword: #p
keyword: freq=noraman
keyword: PBEPBE/SDD
title: #p freq=noraman PBEPBE/SDD
converged: YES YES NO NO
title: Mulliken charges:
elementType: O O O O N N N C C C C C C C C C C C C C C C C H H H H H H H H H H H H H H H H H
charge: -0.272483 -0.287531 -0.233399 -0.229769 -0.428195 0.007233 0.016610 0.249162 0.509485 0.207513 -0.496953 -0.336511 -0.427283 0.500358 -0.408718 -0.243297 -0.399401 -0.344457 0.383618 -0.343006 -0.339252 -0.684977 -0.522077 0.284145 0.246770 0.222985 0.206664 0.217015 0.210503 0.227416 0.280387 0.277616 0.284103 0.284090 0.213198 0.228148 0.237784 0.212892 0.255890 0.233725
chargesum: 0.00000
title: Mulliken charges with hydrogens summed into heavy atoms:
elementType: O O O O N N N C C C C C C C C C C C C C C C C
charge: -0.272483 -0.287531 -0.233399 -0.229769 -0.150578 0.007233 0.016610 0.249162 0.509485 0.207513 -0.212808 -0.089742 -0.204298 0.500358 -0.202054 0.184221 -0.171985 -0.064070 0.383618 -0.058904 -0.055162 -0.005848 0.180430
polarizability: 5.96777827e+02 2.88034107e+01 2.36396979e+02 -1.44808673e+00 -4.60454810e+00 9.61707574e+01
1716.lowfreq: -7.5155 -4.1177 -0.0012 -0.0004 0.0005 2.6052 17.6079 26.1144 29.2363
frequency: 17.5797 26.1113 29.1979 45.1710 55.2198 79.6018 87.4591 102.4808 105.2440 129.1441 131.6139 138.4693 175.3327 192.6181 222.2061 232.8174 239.4974 255.6353 279.4499 298.7471 310.6544 340.6866 362.5876 403.4705 404.0237 420.8141 465.1340 482.6710 496.0895 508.0505 532.2114 559.0858 604.1203 620.8791 634.2552 641.6173 658.0497 664.9894 720.3388 731.7535 739.1066 748.4890 780.6642 796.6524 823.6324 830.0790 849.7363 860.3312 899.0077 906.1825 916.9517 924.3553 941.4485 976.7413 990.6667 999.5588 1002.5750 1031.8054 1077.5012 1096.4885 1110.1781 1111.6197 1117.7684 1119.0831 1134.4655 1156.0422 1170.0663 1177.6508 1211.2059 1225.7064 1257.4044 1262.2014 1262.9327 1284.2811 1299.6062 1329.6218 1349.9151 1361.4459 1383.2813 1400.4575 1407.6387 1415.3370 1442.1013 1446.7891 1456.7484 1461.4482 1474.0250 1480.0083 1484.1339 1484.9964 1495.3250 1534.9127 1555.5655 1579.6165 1596.7866 1611.6001 1619.0346 2962.0482 2967.8143 2976.1575 2998.3670 3022.9646 3084.6280 3095.7471 3107.6534 3127.1030 3127.7881 3128.4499 3165.5923 3174.8350 3175.5142 3184.1140 3196.3344 3387.3616
redmass: 4.8871 6.2603 5.0357 4.8440 2.0996 6.5023 4.6200 3.2797 2.0874 3.8639 1.9323 4.2467 3.6110 4.8555 2.8110 5.9816 1.4160 3.2891 6.3324 5.0783 4.3108 3.9510 6.0173 4.6813 5.9102 3.0689 3.9070 4.4422 2.8679 7.3694 5.8253 5.6251 1.3034 6.2075 4.7444 5.5642 6.6347 4.8846 5.4830 4.7435 3.5160 4.9408 7.5124 1.3982 1.3429 1.1217 5.1977 1.5489 3.3686 1.4333 3.9940 1.5656 1.5524 1.3307 2.9430 1.3267 2.9533 2.7245 5.0894 3.0669 1.4850 1.8470 1.4382 2.0954 1.4350 1.3821 1.3729 1.8336 1.8671 5.0764 2.9857 1.1449 1.4115 1.4199 2.1206 2.2078 4.6507 1.5502 2.7277 1.3416 3.4795 2.2138 1.8015 4.5789 1.0882 1.0401 1.2227 1.0859 1.3342 2.0337 1.6183 2.6121 7.6414 6.1778 4.6489 6.4375 6.4254 1.0555 1.0864 1.0346 1.0363 1.1077 1.0977 1.0989 1.1015 1.0892 1.0903 1.1043 1.0936 1.0917 1.0894 1.0945 1.0962 1.0748
irintensity: 0.1089 1.1883 0.4218 0.8798 5.9762 0.1979 0.1465 1.5914 5.8985 1.4299 3.5990 0.9768 1.8217 0.4881 10.9748 3.4951 2.3139 9.9606 8.9460 4.6648 2.5390 2.3047 22.3669 0.4546 6.5299 0.1712 10.1196 4.4862 21.1585 5.0291 5.5925 1.1192 48.5695 18.3777 15.6153 19.2938 4.4891 23.5866 15.3225 3.5607 7.2603 0.6195 12.3399 39.1982 24.9482 0.0402 0.9989 62.1900 84.0449 1.0637 9.1728 30.6599 31.9818 1.3384 3.2379 0.1097 56.1961 128.1995 201.4711 25.4736 18.8457 26.6719 110.4180 54.8739 4.8312 24.9614 315.8645 30.4527 79.5789 1190.6186 399.4837 0.0509 13.8933 84.2585 142.1175 75.1301 31.7214 29.1588 39.3679 19.6609 75.8982 31.0695 37.2735 17.4788 12.3618 12.8515 125.9513 6.6296 51.5372 77.5596 84.8998 81.8227 26.8725 0.3770 7.2553 176.0915 615.7002 50.0232 67.6799 80.2128 29.1215 30.1750 38.0496 31.0738 32.5835 11.8544 12.2468 13.6861 25.3014 2.0890 0.8821 1.7315 1.2570 27.0862
temp: 298.150 k
press: 1.00000 atm
elementType: 8 8 8 8 7 7 7 6 6 6 6 6 6 6 6 6 6 6 6 6 6 6 6 1 1 1 1 1 1 1 1 1 1 1 1 1 1 1 1 1
symmnumber: 1
zpe: 805987.1 jmol-1
zpe.correction: 0.306984 hartree
zpe.thermalcorrener: 0.329131 hartree
zpe.thermalcorrenthalpy: 0.330075 hartree
zpe.thermalcorrgfe: 0.252851 hartree
zpe.sumelectzpe: -1083.248144 hartree
zpe.sumelectthermal: -1083.225997 hartree
zpe.sumelectthermalent: -1083.225053 hartree
zpe.sumelectthermalfe: -1083.302277 hartree
dipole: -11.4252 -6.1218 1.5548
dipole: 13.0548
quadrupole: -163.2886 -118.7247 -138.4746
quadrupole: -18.5714 -3.0400 2.9384
quadrupole: -23.1260 21.4380 1.6880 -18.5714 -3.0400 2.9384
hfenergy: -1083.5551279 hartree
pointgroup: C01 [X(C16H17N3O4)]
dipole: -4.5413434 -2.207715 0.9393399 debye
polarizability: 597.1583554|15.0849031|233.8612402|-24.8768652|-12.883884|98.3259675 unknown
InChI: InChI=1S/C16H17N3O4/c1-3-23-15-9-4-12(10-16(15)22-2)11-17-18-13-5-7-14(8-6-13)19(20)21/h4-11,18H,3H2,1-2H3
charge 0 multiplicity 1
40 atoms
O  -5.667148 0.758704 0.18215
O  -3.316722 2.308512 -0.167947
O  7.881532 0.158955 -0.291957
O  6.834153 2.181236 -0.49025
N  1.792187 -1.697592 0.176125
N  0.600688 -1.003906 0.149204
N  6.812656 0.89361 -0.3367
C  -4.43007 0.107637 0.248375
C  -1.829794 -1.067928 0.273647
C  -3.262197 0.930516 0.094873
C  -1.99105 0.336848 0.104878
C  -4.274047 -1.288035 0.431181
C  -2.990012 -1.868509 0.442548
C  3.014588 -1.037498 0.045755
C  -0.512642 -1.701329 0.285914
C  -6.893302 -0.067574 0.250217
C  4.217757 -1.804206 0.088007
C  3.07975 0.377091 -0.126465
C  5.511034 0.231665 -0.206426
C  5.462041 -1.173663 -0.03728
C  4.325143 1.006052 -0.25165
C  -8.076697 0.887324 0.122955
C  -4.076697 3.163943 0.768384
H  -1.115149 0.977915 -0.026967
H  -5.150538 -1.930708 0.552139
H  -2.890602 -2.951946 0.579991
H  -0.495194 -2.802958 0.419251
H  -6.877737 -0.806112 -0.576521
H  -6.915735 -0.611831 1.216279
H  4.169613 -2.892073 0.219597
H  2.149307 0.94733 -0.157999
H  1.796569 -2.721501 0.296529
H  6.396672 -1.739463 -0.007522
H  4.40384 2.088334 -0.384459
H  -9.023996 0.31911 0.153098
H  -8.082921 1.617485 0.950168
H  -8.030709 1.439719 -0.830708
H  -3.66313 3.074314 1.791595
H  -5.146764 2.901526 0.766507
H  -3.927781 4.188304 0.394983
