program: Gaussian 09
title: 000290474
version: EM64L-G09RevD.01
frameworkgroup: C1[X(C11H17N3O)]
method: RPBEPBE
basis: SDD
operation: Freq
keyword: #p
keyword: freq=noraman
keyword: PBEPBE/SDD
title: #p freq=noraman PBEPBE/SDD
converged: YES YES NO NO
title: Mulliken charges:
elementType: O N N N C C C C C C C C C C C H H H H H H H H H H H H H H H H H
charge: -0.328361 -0.455998 -0.411794 -0.003935 0.316520 -0.752330 -0.689699 -0.694474 0.338303 -0.531620 0.470491 -0.299016 -0.501998 -0.192382 -0.331469 0.213217 0.229919 0.220925 0.270711 0.202470 0.202734 0.206397 0.203505 0.268602 0.287571 0.220535 0.267005 0.279803 0.279232 0.243152 0.230604 0.241376
chargesum: 0.00000
title: Mulliken charges with hydrogens summed into heavy atoms:
elementType: O N N N C C C C C C C C C C C
charge: -0.328361 -0.168427 -0.131990 -0.003935 0.316520 -0.088270 -0.013783 -0.015969 0.338303 -0.044080 0.470491 -0.019784 -0.258846 0.038222 -0.090093
polarizability: 1.83087989e+02 -6.94810077e-01 1.34251524e+02 -9.16465197e+00 -6.64397992e+00 1.03367182e+02
1716.lowfreq: -13.2077 -3.4557 -0.0002 0.0003 0.0004 4.0605 18.8268 34.8091 36.0141
frequency: 18.7287 34.7803 35.9223 74.1903 103.4154 138.4482 162.3926 192.8625 233.2987 242.8835 254.8976 267.2629 296.1962 312.2500 323.7077 340.9538 383.6095 399.5081 411.7085 451.2297 462.1645 495.8962 529.4316 605.5220 630.2156 690.4111 714.7946 727.2869 764.5639 793.8585 830.5495 894.1990 913.1156 924.2381 924.9390 939.2431 949.6997 951.8791 996.3024 1002.5536 1017.6678 1026.2730 1035.2057 1041.2254 1111.1109 1129.6572 1191.3636 1198.3590 1228.3240 1232.1164 1236.1404 1247.7608 1275.4369 1311.8997 1337.2252 1358.7686 1370.3816 1372.2774 1397.3791 1416.7391 1438.8876 1448.5089 1450.9051 1461.3337 1467.2965 1472.5945 1478.2991 1485.2972 1497.7458 1503.6139 1558.6243 1586.1518 1619.0022 2973.0322 2980.9736 2986.2388 2998.3914 3062.2165 3064.0671 3074.9986 3080.4053 3094.8326 3103.3289 3105.8603 3108.2507 3128.3891 3140.1881 3163.6931 3532.3539 3548.8725
redmass: 3.9836 4.1633 4.4669 5.6292 3.0351 3.5832 3.3812 1.0419 2.9468 3.5317 1.1165 1.0436 1.8958 1.7159 3.1371 2.4578 2.3099 2.9085 2.9610 3.0979 3.2237 1.2389 3.4240 6.1437 6.0247 4.0611 8.2423 2.0261 3.5962 3.1029 2.1076 2.5796 1.6942 1.4150 1.6687 2.5872 1.5102 1.2088 1.5633 2.7873 2.3616 3.1988 1.3827 1.5934 1.8036 2.7690 1.5047 1.6923 2.1287 1.8522 2.7183 1.7960 2.6589 6.4244 1.2313 1.2677 1.2092 1.2114 1.2230 2.0488 1.3112 1.0628 1.2948 1.7712 1.0534 1.0479 1.2038 1.0824 1.8593 1.0824 5.5244 5.6831 4.7253 1.0365 1.0355 1.0362 1.0613 1.1007 1.0999 1.1000 1.0994 1.0977 1.1000 1.0909 1.0994 1.0880 1.0925 1.1001 1.0773 1.0771
irintensity: 2.7163 1.9681 2.4794 11.7408 6.1570 1.9525 0.5406 0.3557 2.1631 9.7784 0.4222 0.1320 3.0291 11.2599 11.0996 4.7458 8.1497 3.1005 3.4229 1.6967 3.4339 196.0029 3.9359 10.8379 4.8063 1.5466 17.6165 37.5668 3.8838 20.0018 22.5215 4.2918 0.2858 0.6267 6.6102 1.2478 0.6106 0.6291 0.0090 8.8843 8.0624 0.6473 0.0782 0.9316 8.7421 24.4963 11.8805 125.8131 43.3763 50.6697 29.7227 4.6761 167.8850 6.3980 11.9433 3.8754 32.9090 41.0134 52.5541 26.3833 70.9876 5.8193 34.8196 2.2494 4.8002 0.9876 46.1916 39.2504 500.1503 8.1760 4.2220 1.0510 129.3689 26.8981 38.8803 26.8930 43.4579 4.7857 24.7335 33.5755 38.5016 48.5317 4.6107 28.1729 18.3094 7.0787 8.8413 23.6495 13.5484 11.4739
temp: 298.150 k
press: 1.00000 atm
elementType: 8 7 7 7 6 6 6 6 6 6 6 6 6 6 6 1 1 1 1 1 1 1 1 1 1 1 1 1 1 1 1 1
symmnumber: 1
zpe: 703217.4 jmol-1
zpe.correction: 0.267841 hartree
zpe.thermalcorrener: 0.283790 hartree
zpe.thermalcorrenthalpy: 0.284734 hartree
zpe.thermalcorrgfe: 0.223138 hartree
zpe.sumelectzpe: -667.721035 hartree
zpe.sumelectthermal: -667.705086 hartree
zpe.sumelectthermalent: -667.704142 hartree
zpe.sumelectthermalfe: -667.765738 hartree
dipole: 3.2569 -0.1468 2.8901
dipole: 4.3568
quadrupole: -100.3314 -82.7576 -93.1826
quadrupole: -3.7213 8.5074 -3.1235
quadrupole: -8.2409 9.3329 -1.0921 -3.7213 8.5074 -3.1235
hfenergy: -667.9888762 hartree
pointgroup: C01 [X(C11H17N3O1)]
dipole: -1.2840876 0.0845279 1.1322897 debye
polarizability: 183.0598988|1.325037|134.9562105|9.0030441|5.0797214|102.6905863 unknown
InChI: InChI=1S/C11H17N3O/c1-11(2,3)14-10(15)13-8-9-5-4-6-12-7-9/h4-7,13-14H,8H2,1-3H3
charge 0 multiplicity 1
32 atoms
O  -1.164491 0.108003 -1.458481
N  -2.297402 0.386512 0.586179
N  -0.154636 1.301961 0.28213
N  4.528647 0.344895 0.583444
C  -3.540999 -0.368653 0.234079
C  -4.442182 -0.324637 1.49257
C  -4.25925 0.311392 -0.96194
C  -3.188895 -1.838682 -0.111556
C  -1.215475 0.563785 -0.268574
C  1.054296 1.581613 -0.508581
C  2.21704 0.643191 -0.20476
C  2.102591 -0.755716 -0.417152
C  3.449615 1.133119 0.292055
C  3.204838 -1.586383 -0.126014
C  4.392255 -0.996851 0.372052
H  -4.699825 0.716915 1.765966
H  -5.385354 -0.862382 1.29678
H  -3.946923 -0.808582 2.355478
H  -3.594148 0.324953 -1.84079
H  -4.536761 1.351753 -0.710841
H  -5.180311 -0.243333 -1.219133
H  -2.684155 -2.327985 0.74135
H  -4.110957 -2.402375 -0.344005
H  -2.521573 -1.873657 -0.987786
H  -2.310049 0.893703 1.473018
H  1.363907 2.631239 -0.34536
H  0.752287 1.473065 -1.566026
H  -0.124454 1.488902 1.285502
H  1.166463 -1.166844 -0.812042
H  3.588866 2.208568 0.466413
H  3.154742 -2.668598 -0.283744
H  5.268594 -1.610194 0.611869
