program: Gaussian 09
title: 000290471
version: EM64L-G09RevD.01
frameworkgroup: C1[X(C11H10ClN3O2)]
method: RPBEPBE
basis: SDD
operation: Freq
keyword: #p
keyword: freq=noraman
keyword: PBEPBE/SDD
title: #p freq=noraman PBEPBE/SDD
converged: YES YES YES YES
title: Mulliken charges:
elementType: Cl O O N N N C C C C C C C C C C C H H H H H H H H H H
charge: -0.062860 -0.216598 -0.216012 -0.508419 -0.477308 -0.015924 0.501238 0.262108 -0.554937 0.393541 -0.441044 -0.316654 0.273835 -0.185779 -0.200511 -0.119869 -0.760972 0.289907 0.259524 0.302657 0.220356 0.313504 0.254569 0.256121 0.238466 0.255529 0.255532
chargesum: 0.00000
title: Mulliken charges with hydrogens summed into heavy atoms:
elementType: Cl O O N N N C C C C C C C C C C C
charge: -0.062860 -0.216598 -0.216012 -0.218512 -0.174652 -0.015924 0.501238 0.262108 -0.295413 0.393541 -0.220688 -0.003150 0.273835 0.068790 0.055610 -0.119869 -0.011444
polarizability: 3.00640840e+02 -1.89214140e+00 1.42663025e+02 1.34361781e-02 -1.11327304e-02 6.60294104e+01
1716.lowfreq: 0.0024 0.0024 0.0026 0.9668 2.2364 12.9216 17.9885 26.4664 53.9237
frequency: 13.8006 26.4464 53.9233 59.3617 65.5622 85.5584 134.8515 152.5528 196.1148 200.3510 248.5360 283.6088 307.3032 339.8126 354.7626 397.6705 405.4941 411.9795 429.5704 511.1555 574.6668 588.8270 596.1132 623.2031 659.3456 674.9734 699.5395 704.6029 735.8338 748.6233 806.3625 810.3491 813.5550 846.6866 860.9029 931.0539 933.3260 973.7780 981.5019 992.0959 1000.7599 1015.5464 1049.8229 1074.9924 1118.1575 1145.3788 1173.9860 1187.4841 1230.0215 1265.4566 1296.4329 1344.4286 1368.5263 1401.4893 1405.7297 1455.7297 1465.7339 1477.5712 1485.8222 1504.8148 1526.8091 1597.4099 1608.1077 1617.7894 1667.7199 2995.4934 3076.8950 3113.0201 3116.6502 3167.2335 3171.9369 3196.6166 3228.7771 3526.8190 3550.0657
redmass: 4.6688 7.1024 7.1248 5.1797 5.9176 1.0777 4.8627 6.9950 8.9854 2.9279 5.6750 6.6531 2.9571 4.5917 5.1989 4.3091 10.1689 3.0172 2.0491 2.6351 3.0418 6.4750 1.4676 7.1066 5.6436 3.7654 5.0218 5.5098 6.9285 8.2013 1.4403 1.4101 7.8239 1.3986 6.4407 3.6924 1.3547 8.1439 1.3123 4.4036 2.2394 2.9030 1.4978 2.5702 1.3366 2.3976 1.8902 1.1161 3.3555 2.2456 1.3578 3.5777 5.6324 4.2331 1.2254 1.0425 1.3522 2.2511 2.4501 2.1003 2.8580 5.3969 6.2108 5.6771 4.9688 1.0372 1.0981 1.0990 1.0900 1.0912 1.0950 1.0955 1.0996 1.0766 1.0766
irintensity: 3.1119 0.0047 0.7150 1.7079 5.2128 1.1017 0.5878 2.6385 0.5797 2.4755 0.5218 9.8871 0.0000 0.1448 0.2505 9.6705 32.6017 0.0284 0.0747 52.4028 18.4876 0.7973 124.1024 1.9065 6.4495 3.4032 12.4743 5.2876 41.0145 22.2497 39.0184 67.8168 10.1919 62.0279 5.8407 10.7296 1.0362 0.7869 3.2733 31.9457 2.8306 0.0053 10.6141 56.0383 18.5817 105.8001 290.3231 0.3262 28.1801 75.0712 27.6790 1.5008 217.5597 14.1590 14.5863 16.6509 20.3857 323.2085 38.3275 998.5713 279.9041 22.1012 18.0414 62.3693 137.8106 17.2902 8.8209 10.8597 18.4194 2.7069 2.6394 9.8299 0.3861 4.5843 18.3671
temp: 298.150 k
press: 1.00000 atm
elementType: 17 8 8 7 7 7 6 6 6 6 6 6 6 6 6 6 6 1 1 1 1 1 1 1 1 1 1
symmnumber: 1
zpe: 513574.7 jmol-1
zpe.correction: 0.195610 hartree
zpe.thermalcorrener: 0.211580 hartree
zpe.thermalcorrenthalpy: 0.212524 hartree
zpe.thermalcorrgfe: 0.148957 hartree
zpe.sumelectzpe: -1198.687056 hartree
zpe.sumelectthermal: -1198.671087 hartree
zpe.sumelectthermalent: -1198.670143 hartree
zpe.sumelectthermalfe: -1198.733710 hartree
dipole: -3.7876 7.8152 -0.0012
dipole: 8.6846
quadrupole: -96.2379 -97.6341 -109.6603
quadrupole: -14.3386 -0.0013 -0.0040
quadrupole: 4.9395 3.5434 -8.4829 -14.3386 -0.0013 -0.0040
hfenergy: -1198.8826668 hartree
pointgroup: C01 [X(C11H10Cl1N3O2)]
dipole: -1.4338238 3.101402 -0.0004908 debye
polarizability: 300.5192357|-4.7724326|142.784629|0.0132308|-0.011376|66.0294104 unknown
InChI: InChI=1S/C11H10ClN3O2/c1-7-6-10(15-17-7)14-11(16)13-9-4-2-8(12)3-5-9/h2-6,13-14H,1H3
charge 0 multiplicity 1
27 atoms
Cl 6.678334 -0.586019 0.000528
O  -4.61203 -1.158068 -0.000204
O  -0.303317 -1.26374 -0.000216
N  0.784415 0.834982 -0.00058
N  -1.549325 0.733152 -0.000763
N  -3.125895 -1.135419 -0.000416
C  2.15184 0.44007 -0.000307
C  -2.848164 0.200074 -0.000527
C  -4.032076 1.029908 -0.000402
C  -5.098768 0.150975 -0.00021
C  3.126676 1.474999 -0.000306
C  2.573242 -0.917182 -0.000046
C  -0.342184 -0.00882 -0.000662
C  4.502719 1.170591 -0.000054
C  3.951381 -1.221098 0.000204
C  4.898392 -0.180567 0.000199
C  -6.58418 0.315896 -0.00003
H  0.633387 1.845722 -0.000689
H  -4.078045 2.11678 -0.000436
H  -1.506617 1.753102 -0.00102
H  2.814733 2.527483 -0.000511
H  1.828737 -1.714722 -0.000045
H  5.248496 1.970372 -0.000056
H  4.278017 -2.264889 0.000403
H  -6.853202 1.384089 0.000212
H  -7.033626 -0.158901 -0.890513
H  -7.033442 -0.159268 0.890348
