program: Gaussian 09
title: 000290454
version: EM64L-G09RevD.01
frameworkgroup: C1[X(C16H20N2O3S)]
method: RPBEPBE
basis: SDD
operation: Freq
keyword: #p
keyword: freq=noraman
keyword: PBEPBE/SDD
title: #p freq=noraman PBEPBE/SDD
converged: YES YES NO NO
title: Mulliken charges:
elementType: S O O O N N C C C C C C C C C C C C C C C C H H H H H H H H H H H H H H H H H H H H
charge: 0.190178 -0.284689 -0.250731 -0.232159 -0.340605 0.055826 0.078267 0.350754 -0.701799 -0.133158 0.498695 -0.012968 -0.274308 -0.398548 -0.419644 -0.229285 -0.224429 -0.248812 -0.545220 -0.517928 -0.504061 -0.665580 0.246667 0.193396 0.193246 0.354586 0.262079 0.242092 0.219941 0.223639 0.224480 0.292195 0.285415 0.232176 0.244095 0.212705 0.241710 0.205320 0.249249 0.227106 0.229807 0.230298
chargesum: 0.00000
title: Mulliken charges with hydrogens summed into heavy atoms:
elementType: S O O O N N C C C C C C C C C C C C C C C C
charge: 0.190178 -0.284689 -0.250731 -0.232159 0.013981 0.055826 0.078267 0.350754 -0.261736 0.060088 0.498695 -0.012968 -0.274308 -0.136469 -0.177552 -0.009343 -0.000790 -0.024332 0.032390 0.171048 0.192217 0.021632
polarizability: 2.62306465e+02 -1.72666770e+01 2.26214707e+02 3.70685198e+00 -1.61554088e+01 1.72096861e+02
1716.lowfreq: -8.5563 -4.9648 -0.0021 -0.0019 -0.0018 5.0390 12.7099 18.5518 28.0642
frequency: 12.5214 18.1568 28.0426 28.3448 41.6710 43.2651 66.2252 76.6417 80.2168 104.1425 108.5840 141.3390 162.0958 169.8121 185.4036 195.2329 211.4385 222.4274 234.5055 263.4589 276.9738 302.2248 316.9304 349.4686 364.0633 395.6810 403.4470 432.3450 468.3495 508.2945 524.3548 556.3293 578.6622 609.7025 616.4959 625.1197 648.2655 675.2349 690.8321 703.5242 729.6921 760.4455 771.7115 781.6641 821.9197 855.2365 871.5642 877.4455 913.2330 919.2474 928.1042 979.6975 988.5509 992.9745 994.5788 996.1813 1014.6867 1027.3118 1033.0504 1049.0928 1056.8927 1070.4433 1088.0403 1110.5461 1118.5973 1142.9323 1158.3018 1170.9804 1185.4924 1194.1496 1198.3148 1210.9901 1213.2480 1230.6295 1280.3988 1296.9365 1305.5081 1312.8272 1330.4122 1340.6996 1383.9438 1399.4145 1423.6678 1434.5480 1440.4218 1446.3525 1453.7944 1455.1551 1457.2158 1462.3656 1472.0281 1473.6341 1477.1876 1482.3163 1484.9847 1527.3576 1579.6336 1594.5575 1611.7109 1640.1789 2927.6519 2953.5892 2963.2583 2988.4282 2993.4016 3038.6007 3056.2043 3058.1481 3074.6712 3083.5051 3086.3957 3114.1760 3120.3834 3123.9358 3132.9414 3135.1242 3136.3936 3146.6738 3161.5848 3485.5448
redmass: 2.1284 4.2377 4.2753 3.5868 3.7762 6.3974 3.4479 3.5992 5.9378 2.9886 4.0573 1.3654 3.8799 1.5612 3.9970 2.7936 4.6928 4.0968 1.1024 4.2863 3.7748 4.4539 6.2632 4.6782 2.3945 6.3926 2.8293 4.9565 4.3578 5.8670 7.9762 5.0987 5.6976 5.9165 6.3072 5.1336 5.3505 6.2120 1.3554 1.9712 3.0736 2.8672 1.1167 4.7543 4.3690 1.2636 5.7463 2.5708 4.6019 3.9515 1.7142 1.3837 3.7483 8.3484 1.8384 1.5870 4.2823 2.4632 4.1947 1.2230 3.2775 2.2142 1.6469 1.2692 1.2698 1.3518 1.6233 1.0570 2.0705 1.4276 2.0242 2.2601 2.4744 1.2232 1.2627 1.4706 1.1556 1.8832 1.7006 1.2910 7.2412 1.2093 1.1443 1.1797 2.0386 1.1376 1.9882 1.1282 1.4381 1.0507 1.0396 1.0731 1.0526 1.0488 2.1523 3.4250 10.8832 6.0511 5.9028 7.6927 1.0834 1.0332 1.0374 1.0356 1.0611 1.1038 1.0606 1.0988 1.0956 1.0965 1.1010 1.0864 1.0994 1.0872 1.1033 1.0923 1.1085 1.0958 1.1014 1.0779
irintensity: 0.0812 1.0471 3.3923 0.2566 1.7881 0.4702 5.8236 6.1696 2.2169 1.9622 0.7315 3.0406 2.0133 1.7640 1.7159 7.5481 3.8897 4.6732 0.1613 0.0919 8.3702 5.1008 12.4047 5.8077 1.7736 6.8479 0.1297 6.1470 21.5624 8.3295 1.2479 3.9642 10.1752 14.0858 1.0835 5.0038 8.0626 5.2813 55.2136 39.6764 36.8954 25.9791 10.0014 4.9821 4.8485 1.7630 106.1295 4.8696 41.6778 12.7356 11.4204 0.5004 14.7012 159.6228 21.0082 3.3490 20.5282 11.3306 6.2112 0.4872 120.7258 2.2597 1.7309 2.5897 1.6598 11.3169 26.6185 0.1381 39.4034 14.9923 30.2009 54.0274 206.4085 0.5809 22.6006 8.6342 15.1276 4.3839 61.1874 3.8825 0.4768 19.4067 3.4037 15.3401 3.6448 38.2101 104.9079 15.0477 90.5812 9.4926 15.8208 5.2880 16.5247 7.9653 28.7098 550.1477 134.5043 0.2396 7.6167 72.6501 37.8922 52.7810 62.5748 33.5971 41.5421 50.5392 1.5517 6.1995 36.4083 20.6458 18.2279 1.2662 20.4953 0.9323 14.2722 13.3625 15.1223 34.8634 28.7563 112.0328
temp: 298.150 k
press: 1.00000 atm
elementType: 16 8 8 8 7 7 6 6 6 6 6 6 6 6 6 6 6 6 6 6 6 6 1 1 1 1 1 1 1 1 1 1 1 1 1 1 1 1 1 1 1 1
symmnumber: 1
zpe: 874731.2 jmol-1
zpe.correction: 0.333168 hartree
zpe.thermalcorrener: 0.356567 hartree
zpe.thermalcorrenthalpy: 0.357511 hartree
zpe.thermalcorrgfe: 0.275659 hartree
zpe.sumelectzpe: -1353.269087 hartree
zpe.sumelectthermal: -1353.245688 hartree
zpe.sumelectthermalent: -1353.244743 hartree
zpe.sumelectthermalfe: -1353.326596 hartree
dipole: -0.7130 6.3343 -0.0949
dipole: 6.3750
quadrupole: -124.8050 -127.5908 -134.6816
quadrupole: 6.9006 -2.1325 11.1117
quadrupole: 4.2208 1.4350 -5.6558 6.9006 -2.1325 11.1117
hfenergy: -1353.6022545 hartree
pointgroup: C01 [X(C16H20N2O3S1)]
dipole: -0.7351665 2.3979391 0.0055818 debye
polarizability: 267.4932128|-9.8349766|221.5941316|5.2151806|-14.3814482|171.5306887 unknown
InChI: InChI=1S/C16H20N2O3S/c1-4-22-16-17-13(15(20-2)21-3)12(14(19)18-16)10-11-8-6-5-7-9-11/h5-9,15,17H,4,10H2,1-3H3
charge 0 multiplicity 1
42 atoms
S  -3.972786 -0.969196 -0.915591
O  -1.466503 3.263303 0.206919
O  0.164803 2.616715 -1.351562
O  0.33054 -2.302518 1.486345
N  -1.877676 0.631599 -0.264168
N  -1.616161 -1.656711 0.341594
C  0.211713 -0.00593 0.749473
C  -0.598921 0.965299 0.197211
C  1.63339 0.220051 1.223364
C  -0.257459 2.434731 0.008263
C  2.679564 -0.308492 0.231357
C  -0.323785 -1.394617 0.894054
C  -2.3167 -0.68075 -0.195004
C  2.803088 0.259484 -1.063051
C  3.543705 -1.367231 0.602493
C  3.787971 -0.21155 -1.959932
C  4.528639 -1.839554 -0.294795
C  4.657268 -1.260133 -1.577769
C  -4.135795 -2.830212 -0.549948
C  -1.771371 3.507413 1.626974
C  0.607706 3.994806 -1.64881
C  -5.476402 -3.325424 -1.104547
H  1.755726 -0.317473 2.180368
H  1.818787 1.294339 1.413521
H  0.522963 2.768209 0.729894
H  -2.462265 1.394411 -0.623909
H  2.116386 1.056654 -1.375228
H  3.426186 -1.834753 1.586295
H  3.873667 0.233878 -2.958079
H  5.18731 -2.663031 0.003912
H  5.419217 -1.627007 -2.275016
H  -3.267769 -3.317155 -1.018787
H  -4.04997 -2.946416 0.540976
H  -2.002625 2.564381 2.16058
H  -2.656021 4.161553 1.634565
H  -0.926849 4.016636 2.13325
H  0.954046 3.969545 -2.692286
H  1.444352 4.288665 -0.982532
H  -0.230378 4.702944 -1.536451
H  -6.332267 -2.812469 -0.631121
H  -5.544747 -3.18279 -2.197488
H  -5.573676 -4.407006 -0.897832
