program: Gaussian 09
title: 000290417
version: EM64L-G09RevD.01
frameworkgroup: C1[X(C8H10FNO3S)]
method: RPBEPBE
basis: SDD
operation: Freq
keyword: #p
keyword: freq=noraman
keyword: PBEPBE/SDD
title: #p freq=noraman PBEPBE/SDD
converged: YES YES NO NO
title: Mulliken charges:
elementType: S F O O O N C C C C C C C C H H H H H H H H H H
charge: 0.045715 -0.179554 -0.258438 -0.283606 -0.243569 -0.375111 0.340683 -0.125321 -0.183822 0.051673 -0.175237 0.045946 -0.508366 -0.500425 0.221570 0.273000 0.348786 0.235577 0.210514 0.230821 0.246422 0.235168 0.204389 0.143185
chargesum: 0.00000
title: Mulliken charges with hydrogens summed into heavy atoms:
elementType: S F O O O N C C C C C C C C
charge: 0.188900 -0.179554 -0.258438 -0.283606 -0.243569 -0.026325 0.340683 0.096249 0.089178 0.051673 -0.175237 0.045946 0.168547 0.185554
polarizability: 1.53757700e+02 -3.79611643e+00 1.49863048e+02 1.71383132e+00 -6.29732974e+00 7.47702633e+01
1716.lowfreq: -63.3469 -6.5344 -0.0025 -0.0024 -0.0016 3.3277 7.2559 33.6683 65.1532
frequency: -63.2039 33.6626 65.1330 85.8341 95.0812 109.4928 127.2330 162.1309 169.9464 197.8781 214.9071 249.7191 256.7489 291.4183 325.6650 335.3226 354.8449 370.6603 497.1050 528.3383 558.5117 579.8373 606.9604 640.6772 705.6962 747.8063 750.3596 821.0860 860.0121 873.2079 905.3107 926.6169 998.4770 1013.1985 1074.1215 1088.8755 1111.9298 1114.0520 1145.9192 1158.0052 1164.7149 1205.7963 1270.9813 1319.0939 1343.4590 1401.3568 1423.6235 1427.2964 1436.5719 1454.8057 1456.6662 1476.7999 1479.4458 1550.3307 1594.6437 1654.4550 2468.5020 2927.1567 2951.3180 2961.9200 3035.5642 3070.1384 3114.5364 3128.1738 3202.6731 3501.9818
redmass: 1.0927 4.4215 3.9724 2.6946 4.1311 8.4825 1.6785 2.6292 2.0738 1.5675 5.1558 5.7804 4.3034 6.9246 5.1868 6.1293 14.5395 5.6762 6.1353 7.5734 5.5288 6.6000 3.7219 5.7820 2.0046 3.2954 6.2385 1.4320 5.0086 1.2494 6.4697 4.9932 10.6274 6.1949 3.4551 2.8319 1.2694 1.2687 1.3348 2.2478 1.9828 5.2170 1.9596 1.1323 1.4210 2.9727 3.1189 1.1504 1.1285 1.0539 1.0597 1.0507 1.0528 7.4562 5.4895 7.8575 1.0384 1.0842 1.0336 1.0372 1.1024 1.0955 1.0995 1.1031 1.0936 1.0774
irintensity: 42.0534 4.1462 1.1535 8.4214 1.4556 0.2915 4.5244 4.7891 1.8546 2.6211 5.1404 2.4227 10.3102 0.3967 1.7422 0.4807 1.6888 6.2003 2.7281 4.6546 2.5678 4.2260 3.7142 48.9113 37.1539 47.0886 4.4197 75.8065 50.7296 13.0382 11.2008 25.5377 139.9893 16.0745 58.6474 93.1114 2.1103 0.9608 7.6267 127.0201 40.1772 18.1391 43.1790 11.5849 53.8970 16.1628 1.7286 4.1412 4.6603 12.2313 7.4938 13.5319 15.0399 95.4775 254.0861 376.7461 6.5553 38.0281 51.8215 74.9468 54.0256 36.9686 24.8038 19.3415 7.8394 63.8927
temp: 298.150 k
press: 1.00000 atm
elementType: 16 9 8 8 8 7 6 6 6 6 6 6 6 6 1 1 1 1 1 1 1 1 1 1
symmnumber: 1
zpe: 449639.1 jmol-1
zpe.correction: 0.171258 hartree
zpe.thermalcorrener: 0.185880 hartree
zpe.thermalcorrenthalpy: 0.186824 hartree
zpe.thermalcorrgfe: 0.128727 hartree
zpe.sumelectzpe: -1088.067676 hartree
zpe.sumelectthermal: -1088.053054 hartree
zpe.sumelectthermalent: -1088.052110 hartree
zpe.sumelectthermalfe: -1088.110207 hartree
dipole: -2.0393 -4.3047 1.1609
dipole: 4.9027
quadrupole: -76.4140 -98.0662 -89.3221
quadrupole: -8.9155 3.5551 3.9434
quadrupole: 11.5201 -10.1321 -1.3880 -8.9155 3.5551 3.9434
hfenergy: -1088.2389341 hartree
pointgroup: C01 [X(C8H10F1N1O3S1)]
dipole: 1.1992698 -1.5013103 0.1684366 debye
dipolederiv: 0.0158604 -0.268602 0.0181442 -0.275879 -0.4714803 0.1117412 0.0327549 0.130501 -0.151225 -0.3359853 -0.3589701 0.0812446 -0.2404972 -0.8556755 0.1489272 0.0830037 0.1666035 -0.1682375 -0.7457177 -0.0576589 0.1693759 -0.0070243 -0.3826195 0.0044242 0.1263533 0.1792629 -1.0770037 -1.0310556 0.0965066 -0.3023857 0.1823928 -0.4066558 0.1441916 -0.363882 0.0670606 -0.7630384 -0.8418469 0.629984 -0.1611157 0.4094823 -0.994879 0.1649007 -0.1271736 0.1981991 -0.4133389 -0.4473891 -0.3098771 0.092162 0.371311 -0.7548584 0.1460593 -0.1005597 0.1011877 -0.2864163 0.0481765 0.0286968 -0.0494395 -0.0204097 0.5341346 -0.1423637 -0.0605808 -0.1238863 -0.0576846 1.0788947 -0.0085783 -0.0353791 -0.1532025 0.4822893 0.0424499 0.2919369 -0.1221578 1.2617033 -0.5384303 -0.581852 0.1580927 -0.124728 -0.5306186 0.0919419 0.0500951 0.0611393 -0.1839788 -0.1194744 0.9415567 -0.2146491 0.2275157 0.6132828 -0.1185046 -0.1175713 -0.0841661 0.0586317 0.8252967 0.6610491 -0.1373444 0.108848 0.8246714 -0.2351915 0.025371 -0.1803085 0.0634941 0.9506659 -0.8303757 0.2038377 -0.531047 1.2928054 -0.2819728 0.1512321 -0.317794 0.3144039 0.2994713 0.0419155 0.0515651 0.1486766 0.3355627 -0.2541216 -0.1246738 -0.1028019 0.5268769 0.7157614 -0.0426799 0.2338675 0.053035 0.2769534 0.0742019 0.1088343 0.0337101 0.292578 -0.0413392 -0.0867237 0.0102133 -0.0391376 -0.1415197 -0.0406605 -0.0177556 0.0138136 -0.0465475 0.1619758 0.026984 -0.005451 0.0314794 0.0291878 0.0388234 -0.0013158 0.0442728 0.1563133 0.2354498 0.0001158 -0.0105707 0.0021426 0.1864111 0.0396261 -0.0102153 0.0290419 0.3137819 0.0322612 0.0355208 0.1109081 0.0632249 0.064129 -0.0603261 0.094962 -0.029312 -0.0800854 0.0349688 -0.077091 -0.0347272 -0.1353735 -0.1437455 0.0521481 -0.0427265 -0.0749757 0.0088103 -0.1292503 0.035824 -0.1276346 -0.0028674 0.0344485 0.0869471 -0.056789 0.0188941 0.0201449 -0.063621 0.0316919 0.0251787 0.0157302 0.0671707 -0.0660669 0.1444926 -0.0776225 -0.0206265 0.0331385 0.0145533 -0.0431991 0.0489779 0.038901 0.1174879 -0.0908546 0.1067738 -0.044225 -0.0482783 -0.0060119 -0.050721 -0.135521 -0.1606106 -0.0894653 -0.00785 -0.0250799 0.0833127 -0.0895331 0.0840217 0.0180271 0.0028707 0.062715 0.0248022 0.0129121 -0.0123557 0.1923566 unknown
polarizability: 151.7008346|4.2829397|144.5578328|-0.6251802|-23.5760784|82.1323443 unknown
InChI: InChI=1S/C8H10FNO3S/c1-12-8(13-2)4-3-5(14)10-7(11)6(4)9/h3,8,10,14H,1-2H3
charge 0 multiplicity 1
24 atoms
S  -2.82137 -2.850347 0.694203
F  -0.115842 2.382957 -0.521468
O  2.172223 -0.369762 -1.208129
O  2.130033 -0.650375 1.119767
O  -2.945782 2.025207 -0.594073
N  -2.647932 -0.229031 -0.00892
C  0.110677 0.051728 0.075327
C  1.62626 0.166487 0.058696
C  -0.49402 -1.216311 0.373559
C  -0.694215 1.133882 -0.238465
C  -1.872902 -1.330406 0.321854
C  -2.15073 1.084182 -0.307399
C  2.065827 0.56968 -2.333259
C  3.588762 -0.544645 1.295348
H  1.9550 1.226918 0.160411
H  0.150807 -2.048742 0.656209
H  -3.669394 -0.304532 -0.071901
H  2.623274 0.107081 -3.161982
H  2.512907 1.553553 -2.082532
H  1.012179 0.723635 -2.63743
H  4.115317 -0.908743 0.396696
H  3.827353 -1.175572 2.164347
H  3.882754 0.504546 1.503602
H  -1.727486 -3.693193 0.705939
