program: Gaussian 09
title: 000290406
version: EM64L-G09RevD.01
frameworkgroup: C1[X(C15H11N3O2)]
method: RPBEPBE
basis: SDD
operation: Freq
keyword: #p
keyword: freq=noraman
keyword: PBEPBE/SDD
title: #p freq=noraman PBEPBE/SDD
converged: YES YES NO NO
title: Mulliken charges:
elementType: O O N N N C C C C C C C C C C C C C C C H H H H H H H H H H H
charge: -0.216250 -0.232659 -0.436969 -0.040011 -0.614649 0.276275 0.137559 0.005604 0.388343 -0.362808 0.224125 -0.373276 -0.452389 -0.255997 -0.435420 -0.030035 -0.249193 -0.249306 0.133360 -0.168927 0.268979 0.249287 0.242232 0.233900 0.240085 0.339380 0.230867 0.231678 0.235854 0.358897 0.321464
chargesum: 0.00000
title: Mulliken charges with hydrogens summed into heavy atoms:
elementType: O O N N N C C C C C C C C C C C C C C C
charge: -0.216250 -0.232659 -0.097589 -0.040011 0.065713 0.276275 0.137559 0.005604 0.388343 -0.093829 0.224125 -0.123989 -0.210158 -0.022097 -0.195335 -0.030035 -0.018326 -0.017628 0.133360 0.066927
polarizability: 2.75073816e+02 1.55695858e+01 2.16231962e+02 2.81695781e+00 1.24048803e+01 1.18684954e+02
1716.lowfreq: -7.0029 -0.0010 -0.0007 -0.0004 6.1021 7.5592 36.9443 41.9180 60.1700
frequency: 36.8903 41.9001 60.1596 92.2335 142.8741 151.0512 176.2382 181.2798 188.5389 232.5131 261.2639 281.7661 334.1798 338.3763 360.3874 396.2733 419.0391 450.4860 470.9992 504.4089 511.6742 527.6765 540.2244 553.0423 565.1927 589.5190 614.2767 645.8661 675.4982 701.2943 713.4104 732.5440 746.4450 765.5673 780.3922 785.0650 800.7931 813.6581 872.6948 907.3355 918.8510 946.7979 962.4443 973.0367 985.2098 993.4052 995.0686 1028.8043 1058.4314 1074.0955 1109.1221 1154.4557 1175.7230 1187.0356 1201.0734 1236.7891 1255.8652 1271.1398 1286.7966 1346.6915 1359.1165 1395.9357 1402.6406 1409.8045 1439.4931 1450.9580 1467.3193 1513.0278 1552.8221 1557.7126 1576.1617 1586.6490 1591.3924 1600.5296 1628.2172 1635.9697 3026.5679 3123.6590 3127.2408 3134.4354 3151.0597 3153.9375 3166.0372 3182.1888 3444.7431 3551.0792 3703.3473
redmass: 6.1194 7.2558 5.1778 8.1825 5.8126 5.7392 4.2962 6.4233 6.1865 3.7038 4.1921 4.5825 1.3009 3.5753 4.0194 7.3088 3.5121 4.5061 3.2969 6.0595 7.3092 5.2348 1.1601 4.6650 5.2442 6.6345 5.2713 3.8409 6.0983 6.8578 1.2510 3.0217 1.5272 7.7720 2.1156 5.4015 4.3238 1.7661 1.5858 2.9989 1.8965 1.7319 1.4281 2.7790 1.3906 1.3559 5.0967 2.5292 2.4435 2.6084 2.5985 1.3886 1.1014 2.6418 1.6944 1.9076 1.6915 1.9711 2.4052 1.3400 2.8418 3.9565 2.2994 5.9073 2.5175 2.7623 5.1119 3.8114 7.5292 6.6808 3.6790 3.9351 3.4972 4.6064 6.3914 2.2242 1.0905 1.0866 1.0876 1.0881 1.0941 1.0945 1.1002 1.0957 1.0772 1.0453 1.1054
irintensity: 5.9847 1.1873 1.3654 4.1423 1.2194 1.5884 3.4216 11.0379 14.2751 3.9756 7.4619 2.9827 59.3568 29.4631 2.9662 2.6846 3.5809 1.0228 1.8521 5.2049 4.8970 4.2272 216.5787 9.0504 3.5366 14.2868 2.9735 1.0297 3.0774 5.7613 105.6953 17.3295 5.0828 8.3472 60.0007 0.9054 6.4217 48.6887 4.0811 26.6271 3.2313 2.8287 1.0765 0.5423 1.1669 0.8576 12.4392 7.3930 53.4818 16.9694 1.7155 2.0975 2.1370 39.3202 8.6435 6.4940 20.3996 34.2763 21.1191 36.1998 9.4561 10.3301 2.3851 1.2704 0.9059 44.8748 179.9548 15.8747 318.0032 472.8566 41.7460 25.7985 2.7823 18.6184 8.0252 628.2422 27.1319 1.4743 3.9740 5.4618 25.0757 33.0580 24.4677 5.0190 83.3287 142.1763 47.8982
temp: 298.150 k
press: 1.00000 atm
elementType: 8 8 7 7 7 6 6 6 6 6 6 6 6 6 6 6 6 6 6 6 1 1 1 1 1 1 1 1 1 1 1
symmnumber: 1
zpe: 604448.6 jmol-1
zpe.correction: 0.230222 hartree
zpe.thermalcorrener: 0.246383 hartree
zpe.thermalcorrenthalpy: 0.247327 hartree
zpe.thermalcorrgfe: 0.186298 hartree
zpe.sumelectzpe: -891.544259 hartree
zpe.sumelectthermal: -891.528099 hartree
zpe.sumelectthermalent: -891.527155 hartree
zpe.sumelectthermalfe: -891.588184 hartree
dipole: -1.2263 -4.1341 0.9269
dipole: 4.4106
quadrupole: -76.9350 -125.8974 -120.5823
quadrupole: 14.4617 2.1062 16.8656
quadrupole: 30.8699 -18.0925 -12.7774 14.4617 2.1062 16.8656
hfenergy: -891.7744817 hartree
pointgroup: C01 [X(C15H11N3O2)]
dipole: 0.5153016 -0.2800109 1.6331748 debye
polarizability: 275.1261204|8.5673467|120.2835521|14.0364802|16.8530414|214.5810587 unknown
InChI: InChI=1S/C15H11N3O2/c16-15-17-12(8-19)13(14(20)18-15)11-7-3-5-9-4-1-2-6-10(9)11/h1-8,17H,16H2
charge 0 multiplicity 1
31 atoms
O  1.404747 0.731178 -2.742912
O  1.640522 -1.808991 2.700357
N  2.917748 -0.28024 0.896779
N  3.134597 0.884064 -1.17986
N  4.915958 0.857264 0.332866
C  -0.48832 -0.362732 -0.801574
C  -1.530714 0.104467 0.099175
C  0.953782 -0.154136 -0.522617
C  -2.915953 -0.179863 -0.231853
C  -0.850313 -1.001304 -2.002015
C  1.574786 -0.588306 0.644557
C  -1.268707 0.88157 1.279708
C  -3.227904 -0.880804 -1.441941
C  -2.213234 -1.269315 -2.317666
C  -3.958181 0.262864 0.649853
C  1.830317 0.512035 -1.570315
C  -2.305849 1.312644 2.109852
C  -3.664625 0.988129 1.804437
C  3.632519 0.492492 -0.007348
C  0.971781 -1.45533 1.682933
H  -0.066091 -1.302765 -2.700324
H  -0.239376 1.166204 1.518947
H  -4.278187 -1.092219 -1.675426
H  -2.454467 -1.785279 -3.252666
H  -4.997526 0.028465 0.390243
H  3.302096 -0.671104 1.766943
H  -2.079015 1.911352 2.998801
H  -4.467949 1.324477 2.468546
H  -0.065956 -1.797381 1.509754
H  5.429646 1.400766 -0.357249
H  5.338166 0.646297 1.233115
