program: Gaussian 09
title: 000290386
version: EM64L-G09RevD.01
frameworkgroup: C1[X(C13H13FN4O3S2)]
method: RPBEPBE
basis: SDD
operation: Freq
keyword: #p
keyword: freq=noraman
keyword: PBEPBE/SDD
title: #p freq=noraman PBEPBE/SDD
converged: YES YES NO NO
title: Mulliken charges:
elementType: S S F O O O N N N N C C C C C C C C C C C C C H H H H H H H H H H H H H
charge: 0.970566 0.199998 -0.165937 -0.500199 -0.524567 -0.205467 -0.510202 -0.374808 0.022954 0.040708 -0.005793 -0.248959 -0.245314 0.298698 -0.196831 -0.195648 -0.240658 -0.211217 -0.316224 0.079956 -0.544395 -0.005850 -0.664365 0.286489 0.285431 0.323699 0.367202 0.248161 0.248795 0.266682 0.244436 0.289712 0.291168 0.228372 0.230478 0.232931
chargesum: 0.00000
title: Mulliken charges with hydrogens summed into heavy atoms:
elementType: S S F O O O N N N N C C C C C C C C C C C C C
charge: 0.970566 0.199998 -0.165937 -0.500199 -0.524567 -0.205467 -0.186503 -0.007606 0.022954 0.040708 -0.005793 0.037529 0.040117 0.298698 0.051329 0.053147 -0.240658 0.033219 -0.049542 0.079956 0.036485 -0.005850 0.027416
polarizability: 3.78485237e+02 -8.91117913e+00 2.57083824e+02 -5.42942271e+00 9.11095852e-01 1.49420316e+02
1716.lowfreq: -11.0176 -10.1281 -1.8787 -0.0012 0.0008 0.0009 2.6609 11.8494 19.3888
frequency: -8.8977 9.0740 19.1246 23.9930 38.8710 40.5130 61.0328 82.5974 92.6622 118.4377 125.4101 145.8714 159.3689 165.8794 203.9570 229.4633 232.1102 240.0680 245.9645 261.8592 271.3981 289.3282 308.2156 338.9041 351.9374 354.0831 390.6072 404.3850 416.0702 440.8718 455.6429 497.4488 505.9463 560.1444 592.5477 600.4028 616.3347 637.1841 653.5097 667.5926 688.2593 707.5287 712.0003 747.6149 753.2160 763.4472 771.5373 813.1494 850.2258 888.7993 917.7462 938.5324 959.5735 975.6441 987.0378 991.2986 1000.1417 1007.1187 1009.3771 1025.5243 1044.7557 1048.8484 1069.8815 1079.8551 1105.4722 1175.8044 1179.6431 1194.0066 1203.8880 1230.1437 1270.5840 1279.6927 1305.0411 1314.9720 1384.4497 1388.3199 1398.0019 1438.5635 1445.8847 1451.6560 1455.4865 1471.4066 1481.8232 1524.6682 1546.6755 1574.5666 1590.9666 1604.0249 1625.1652 2988.9025 3056.4698 3084.2043 3087.1853 3097.8660 3137.3376 3143.2328 3153.2896 3161.4837 3170.5052 3179.5416 3264.9123 3469.6140
redmass: 4.9912 2.7400 6.5875 6.5674 4.2327 3.5205 8.8516 7.7657 6.0863 7.5249 6.1156 7.2901 11.2051 11.0974 5.9452 6.0834 1.1205 4.1968 8.4427 4.8045 6.8816 6.1261 7.3468 8.1700 9.5493 8.6710 9.1883 2.8363 10.2502 9.2974 2.8851 4.2099 10.9568 4.5707 7.2674 6.4847 4.7680 7.4933 6.2524 8.7570 2.3795 1.2331 2.3478 10.4636 6.8485 1.4091 1.1155 14.0732 1.2425 1.5013 6.2705 1.3527 14.2568 6.3543 1.3932 2.4371 3.9331 4.1619 1.3609 5.8504 2.1327 1.2189 2.2971 1.5588 4.1202 1.0604 1.1215 3.1232 6.5099 1.2245 1.2370 1.2565 1.3002 1.8509 8.3113 2.1699 1.2074 2.2573 1.1146 2.0191 5.9774 1.0396 1.0494 3.9793 8.4580 5.7870 12.2410 6.9311 7.1270 1.0356 1.0606 1.0964 1.1013 1.0915 1.1085 1.0862 1.0887 1.0929 1.0972 1.1017 1.0752 1.0784
irintensity: 1.3800 0.2691 1.7375 1.1056 0.6945 1.0843 4.3586 1.2285 4.7068 4.1842 1.6585 1.1311 4.2129 0.6458 10.3284 25.2839 1.3027 5.8425 16.1668 3.0201 3.1541 10.9739 3.7417 0.6215 19.4318 15.5782 13.9101 0.0098 46.0913 101.9395 128.2074 55.7551 11.2764 59.9415 14.9627 0.1426 12.0925 5.0261 3.4915 18.9803 20.2583 73.5161 338.8117 3.2541 53.6578 71.0258 12.7566 92.9582 0.4942 31.1375 36.5857 2.9933 66.4006 3.0165 0.0904 5.5992 53.9765 0.4827 0.2383 5.5325 28.4477 0.2441 1.7017 3.5534 4.2597 0.6425 12.3566 291.3565 94.3720 0.5796 19.1476 24.3436 3.5128 6.2449 8.4867 83.9516 17.2769 16.0696 23.5151 22.2732 184.6661 16.3060 7.0023 432.6739 39.0081 6.0823 348.3527 0.3883 47.8760 28.6617 1.3595 19.8842 17.6176 9.8410 14.3902 1.1644 8.6081 0.6458 1.8297 22.6114 6.8610 105.1826
temp: 298.150 k
press: 1.00000 atm
elementType: 16 16 9 8 8 8 7 7 7 7 6 6 6 6 6 6 6 6 6 6 6 6 6 1 1 1 1 1 1 1 1 1 1 1 1 1
symmnumber: 1
zpe: 653372.6 jmol-1
zpe.correction: 0.248856 hartree
zpe.thermalcorrener: 0.271763 hartree
zpe.thermalcorrenthalpy: 0.272708 hartree
zpe.thermalcorrgfe: 0.192353 hartree
zpe.sumelectzpe: -1841.928424 hartree
zpe.sumelectthermal: -1841.905517 hartree
zpe.sumelectthermalent: -1841.904572 hartree
zpe.sumelectthermalfe: -1841.984927 hartree
dipole: -7.2148 4.8832 -2.7425
dipole: 9.1335
quadrupole: -161.3149 -138.2972 -156.7067
quadrupole: 19.9532 30.5707 -7.7125
quadrupole: -9.2086 13.8091 -4.6004 19.9532 30.5707 -7.7125
hfenergy: -1842.1772802 hartree
pointgroup: C01 [X(C13H13F1N4O3S2)]
dipole: 2.9099233 -1.8930047 -0.9281278 debye
polarizability: 379.2116399|-2.5164626|254.882173|0.6919998|-13.0297658|150.8955636 unknown
InChI: InChI=1S/C13H13FN4O3S2/c1-2-22-13-16-10(11(14)12(19)17-13)8-15-18-23(20,21)9-6-4-3-5-7-9/h3-8,16,18H,2H2,1H3
charge 0 multiplicity 1
36 atoms
S  3.083312 0.732401 1.103251
S  -2.843307 -2.417656 0.781254
F  -2.921577 3.171093 -1.252695
O  2.199143 -0.099097 2.178509
O  4.154925 1.887573 1.503083
O  -5.322817 1.653114 -1.074324
N  1.866003 1.750364 -0.043199
N  -1.766061 -0.021538 0.109028
N  0.613228 1.269187 -0.043599
N  -4.127947 -0.198739 -0.221619
C  3.863569 -0.478293 -0.105679
C  4.98249 -0.044283 -0.834476
C  3.30013 -1.760813 -0.198005
C  -1.735831 1.29411 -0.367849
C  5.568148 -0.969593 -1.728715
C  3.90276 -2.667337 -1.100795
C  -2.972575 -0.709549 0.154078
C  5.026603 -2.270451 -1.863283
C  -0.447948 1.974279 -0.396446
C  -2.935195 1.858872 -0.769579
C  -4.680776 -2.911321 0.690462
C  -4.227629 1.142223 -0.715799
C  -4.822193 -4.366453 1.150657
H  5.389155 0.962219 -0.694636
H  2.444266 -2.043214 0.422811
H  2.066558 2.757479 0.14046
H  -0.874637 -0.421024 0.427617
H  6.444565 -0.673998 -2.31407
H  3.495533 -3.678134 -1.203432
H  -0.420476 3.022802 -0.724418
H  5.487116 -2.979469 -2.559278
H  -5.227218 -2.201447 1.329353
H  -4.995568 -2.753798 -0.351947
H  -4.254981 -5.058776 0.503751
H  -4.482857 -4.503381 2.192571
H  -5.888014 -4.655353 1.102057
