program: Gaussian 09
title: 000290378
version: EM64L-G09RevD.01
frameworkgroup: C1[X(C9H7NO)]
method: RPBEPBE
basis: SDD
operation: Freq
keyword: #pfreq=noraman
keyword: PBEPBE/SDD
title: #p freq=noraman PBEPBE/SDD
converged: NO NO NO NO
title: Mulliken charges:
elementType: O N C C C C C C C C C H H H H H H H
charge: -0.344577 0.036337 0.333519 0.362853 -0.372604 -0.310545 -0.380464 -0.388459 -0.228028 -0.227260 -0.238337 0.289679 0.242682 0.238124 0.237311 0.282789 0.233156 0.233821
chargesum: 0.00000
title: Mulliken charges with hydrogens summed into heavy atoms:
elementType: O N C C C C C C C C C
charge: -0.344577 0.036337 0.333519 0.362853 -0.082924 -0.067863 -0.142340 -0.151148 0.054761 0.005896 -0.004516
polarizability: 1.89490571e+02 2.06684112e-01 1.10994505e+02 2.79746845e-03 1.80392624e-03 4.08026005e+01
1716.lowfreq: -12.2461 -6.8136 -0.0006 -0.0006 0.0004 13.1273 116.6708 183.5782 282.0023
frequency: 116.6697 183.5779 282.0022 292.2050 399.8877 428.0881 467.1831 479.2900 523.6226 529.9957 623.3308 636.9849 723.3757 757.6656 763.4357 764.0238 817.9706 847.4625 881.5636 899.2303 945.4224 955.3655 965.3134 991.8955 1021.3042 1124.1968 1141.8399 1171.8074 1182.1743 1230.9858 1266.3001 1273.2788 1325.6371 1370.5783 1413.5579 1440.1240 1461.4885 1492.7741 1551.2447 1601.4102 1640.5642 3127.5745 3133.3116 3149.3152 3151.4980 3167.1667 3195.1927 3214.3130
redmass: 6.4192 3.7202 4.9233 5.7824 3.1802 8.0249 2.5309 6.2069 6.2049 3.5108 6.7182 2.9525 6.7147 1.3453 2.7788 4.7992 1.3475 1.4921 1.6241 4.6608 1.3083 3.7816 1.3946 1.3389 2.2778 1.7886 1.4372 1.2312 1.5698 1.9584 1.9375 1.8407 3.7480 1.7708 4.4554 2.2898 3.7417 3.6470 6.1327 5.6267 6.7133 1.0860 1.0890 1.0951 1.0911 1.1005 1.0927 1.0972
irintensity: 1.6238 2.5654 3.9087 0.9030 0.1278 4.1967 25.4159 6.1594 1.3979 0.0789 7.2755 0.3444 8.7372 42.6728 0.9349 1.8418 28.6903 93.0935 3.4089 3.6299 0.2321 0.8225 5.5680 0.0056 5.1387 22.0540 2.7958 26.9908 45.0967 21.8037 33.0952 7.4049 44.0441 4.7068 1.8419 16.0674 6.5593 12.8528 19.8559 7.4525 39.2765 2.8834 1.4849 20.4659 12.9691 24.9402 0.3333 1.1708
temp: 298.150 k
press: 1.00000 atm
elementType: 8 7 6 6 6 6 6 6 6 6 6 1 1 1 1 1 1 1
symmnumber: 1
zpe: 359616.6 jmol-1
zpe.correction: 0.136971 hartree
zpe.thermalcorrener: 0.144749 hartree
zpe.thermalcorrenthalpy: 0.145693 hartree
zpe.thermalcorrgfe: 0.104406 hartree
zpe.sumelectzpe: -476.330552 hartree
zpe.sumelectthermal: -476.322774 hartree
zpe.sumelectthermalent: -476.321830 hartree
zpe.sumelectthermalfe: -476.363116 hartree
dipole: 4.3001 1.5424 0.0001
dipole: 4.5684
quadrupole: -71.8567 -52.5665 -67.8025
quadrupole: -6.0963 -0.0005 0.0002
quadrupole: -7.7814 11.5087 -3.7273 -6.0963 -0.0005 0.0002
hfenergy: -476.4675226 hartree
pointgroup: C01 [X(C9H7N1O1)]
dipole: -1.6858932 -0.6230793 0.000059 debye
dipolederiv: -1.2874156 -0.1182756 -0.0000125 -0.3792197 -0.3756314 -0.0000042 0.000157 0.0000123 -0.3315096 1.2358121 0.2588344 -0.0000288 0.3405066 0.175859 -0.000008 -0.0001957 0.0000004 0.1059438 0.3852007 0.0788355 -0.0000015 -0.0130426 -0.0784463 0.0000077 0.0000053 0.0000088 0.0621143 -0.1389413 0.0003375 0.0000021 0.0077066 -0.182124 0.0000059 0.0000116 0.000005 0.0265103 -0.414977 -0.0903741 0.0000332 0.2839542 0.1207028 -0.0000221 0.0000156 -0.0000146 -0.1529349 0.2096347 -0.0386028 -0.0000026 -0.0322416 0.1421013 -0.0000003 -0.0000016 -0.0000165 -0.1092033 -0.1810719 -0.0259529 0.0000016 0.0302426 0.1222568 -0.0000132 -0.00001 -0.0000199 -0.1694048 0.1269147 -0.0170039 -0.0000035 0.089329 0.13088 -0.0000082 -0.0000063 -0.0000034 -0.1566989 -0.1090961 -0.0750274 0.0000057 -0.3063367 0.0035922 0.0000261 0.0000235 0.0000016 -0.134868 0.0588515 -0.0620445 0.000002 -0.1233816 0.1246489 -0.0000069 0.0000102 -0.0000085 -0.1424273 -0.066276 0.1123764 -0.0000061 0.1311953 -0.0938819 -0.0000056 -0.0000123 -0.0000058 -0.1663959 0.0492588 -0.0052318 -0.0000041 -0.0101801 0.018535 0.0000065 0.0000017 0.0000093 0.184852 0.0942437 -0.0520685 0.0000031 0.0132463 -0.0693112 0.000001 -0.0000084 0.0000091 0.1519754 0.0705696 -0.060053 0.0000033 0.0008601 -0.0850764 0.0000086 -0.000001 0.0000093 0.1585605 0.0772917 0.0107433 0.000001 -0.0571528 -0.1000932 0.0000069 0.0000024 0.0000052 0.1574454 0.0378208 0.0480089 0.0000022 -0.0165735 0.0695285 -0.000003 0.0000038 -0.0000045 0.1903345 -0.0490074 0.1048652 -0.0000019 0.109695 0.0130725 0.0000043 -0.0000042 0.0000084 0.1598573 -0.0988128 -0.0693668 0.0000066 -0.0686072 0.0633873 0.0000043 0.0000084 0.0000038 0.1658492 unknown
polarizability: 189.4793331|0.961607|111.0057427|-0.00278|-0.0018307|40.8026005 unknown
InChI: InChI=1S/C9H7NO/c11-10-6-5-8-3-1-2-4-9(8)7-10/h1-7H
charge 0 multiplicity 1
18 atoms
O  3.442187 0.751127 -0.000014
N  2.192818 0.288326 0.000152
C  -0.227884 0.6299 0.000101
C  -0.453219 -0.802338 0.000144
C  1.102447 1.129686 0.000088
C  0.709038 -1.646911 0.000129
C  -1.361844 1.51051 0.000082
C  -1.788454 -1.306046 0.000169
C  1.982601 -1.113701 0.000106
C  -2.658355 0.988259 0.000114
C  -2.877635 -0.426018 0.00016
H  1.350176 2.192462 0.000041
H  0.598644 -2.736265 0.000138
H  -1.198687 2.594181 0.00004
H  -1.950029 -2.390476 0.000195
H  2.910275 -1.686858 0.00007
H  -3.519152 1.665972 0.000094
H  -3.901228 -0.815109 0.00019
