program: Gaussian 09
title: 000290364
version: EM64L-G09RevD.01
frameworkgroup: C1[X(C15H24N2O3)]
method: RPBEPBE
basis: SDD
operation: Freq
keyword: #p
keyword: freq=noraman
keyword: PBEPBE/SDD
title: #p freq=noraman PBEPBE/SDD
converged: YES YES NO NO
title: Mulliken charges:
elementType: O O O N N C C C C C C C C C C C C C C C H H H H H H H H H H H H H H H H H H H H H H H H
charge: -0.240437 -0.461138 -0.273301 -0.178472 -0.392817 -0.351725 -0.047507 -0.348322 -0.334962 -0.425835 -0.330423 -0.322278 -0.467378 0.435387 -0.362782 -0.392691 -0.356063 -0.353757 0.305551 -0.537341 0.232301 0.223712 0.184393 0.216566 0.233300 0.209696 0.207027 0.173822 0.244421 0.191839 0.224422 0.221478 0.194979 0.209583 0.215714 0.335165 0.349934 0.216294 0.209381 0.231318 0.242812 0.213621 0.215208 0.239306
chargesum: 0.00000
title: Mulliken charges with hydrogens summed into heavy atoms:
elementType: O O O N N C C C C C C C C C C C C C C C
charge: -0.240437 -0.125972 -0.273301 -0.178472 -0.042884 0.104287 0.136886 0.101543 0.081761 -0.007592 0.085837 0.094179 -0.042080 0.435387 -0.146489 -0.183310 -0.124745 -0.110945 0.305551 0.130795
polarizability: 2.50481198e+02 -7.72066025e+00 1.89057639e+02 -1.67065579e+01 1.23635958e+01 1.34992167e+02
1716.lowfreq: -9.1809 -4.3315 -0.0007 0.0003 0.0003 3.3398 19.3318 27.7285 42.6145
frequency: 18.7358 27.4876 42.5448 50.1838 67.2475 78.8862 112.9275 119.8446 142.4784 154.6831 191.5597 227.8605 239.8855 248.8003 263.3478 302.0742 304.0945 316.1392 328.0486 359.6430 366.7085 393.1326 413.1278 413.8901 439.7241 467.8885 471.3427 497.0949 510.8584 512.0798 535.4344 615.4500 631.2609 678.6238 711.9936 761.0756 772.8831 788.3089 798.8955 809.3453 812.5002 836.5445 851.2485 879.4420 900.1582 901.0193 928.2601 937.9655 968.8371 986.3975 996.3180 999.9854 1013.0649 1026.4613 1053.7727 1062.2151 1078.0797 1088.2653 1094.8367 1113.2280 1114.7053 1121.1439 1129.2603 1137.4976 1157.3259 1178.6176 1187.6874 1193.7328 1216.3211 1220.3189 1240.5905 1252.9022 1266.2455 1282.0147 1290.2938 1295.5297 1297.1450 1315.7114 1324.5892 1335.2267 1341.2843 1349.3850 1362.9311 1369.1586 1376.0799 1377.9566 1403.8072 1430.3524 1436.5914 1446.1295 1448.8204 1453.2725 1454.6865 1460.3087 1463.3678 1471.7220 1475.6017 1478.4907 1507.6712 1542.1469 1591.6648 1638.8190 2896.0699 2901.9872 2921.1282 2932.2769 2943.9661 2944.0573 2945.6514 2951.4394 2976.9265 3027.2180 3032.9282 3037.5368 3044.1667 3045.2908 3048.3569 3083.1305 3086.1173 3115.1258 3118.1021 3134.4094 3156.2195 3160.4365 3221.1860 3560.5721
redmass: 3.7110 4.8305 5.1059 3.3361 4.3057 3.6381 3.5043 4.0471 3.5258 4.1319 3.5381 2.4208 1.7906 1.5057 3.0339 1.1826 2.5236 5.0894 2.1696 3.8988 3.2366 3.2450 2.5364 3.0512 2.3328 2.8015 3.0057 3.9016 3.3345 2.4549 2.9104 2.0766 6.6231 3.5184 3.4282 2.4807 2.2859 1.4740 2.5436 3.6490 1.6764 1.6109 1.8707 1.8936 1.4243 2.1863 2.2182 1.3508 2.6089 4.1628 3.8588 3.3351 2.5874 2.1826 2.2324 2.2285 1.9020 3.4684 2.3087 1.2610 2.2531 1.8999 2.1494 2.3603 1.3306 1.2570 1.1216 1.3144 1.5314 1.9329 1.2431 1.2783 1.1960 1.1991 1.2097 1.5725 1.2681 1.7984 1.4641 1.2434 1.3601 1.3700 1.3578 1.2878 3.1389 1.4433 1.5346 3.9588 1.1721 1.0814 1.0841 1.0927 1.1033 1.0958 1.0508 1.0967 1.0827 1.0911 2.4188 1.8621 2.7914 6.5820 1.0697 1.0685 1.0677 1.0820 1.0663 1.0666 1.0346 1.0672 1.0656 1.1033 1.0924 1.0940 1.0914 1.0943 1.0967 1.0947 1.0967 1.0983 1.0881 1.0863 1.0947 1.0953 1.0808 1.0659
irintensity: 0.2120 0.1736 0.5218 1.7128 0.2972 2.7688 3.6053 1.2900 1.5022 5.5659 4.6068 3.7026 3.3524 0.5335 6.3244 127.9140 2.4352 3.7285 44.3117 3.4737 4.2584 0.7121 10.9279 0.7737 4.1645 0.3309 5.7032 5.6368 7.7457 27.2522 2.6289 0.6685 1.1862 58.4692 0.3483 61.6789 8.7490 10.6724 1.8832 26.0028 78.2822 1.7552 10.7331 16.2487 1.3412 18.5683 72.7535 0.7963 46.8113 15.2187 44.4586 51.4048 12.0848 12.7346 18.5168 5.4951 12.9175 34.9322 33.8509 0.1949 2.2858 36.7935 20.9533 4.3907 0.5529 28.8979 0.1648 6.7056 105.6284 159.8769 4.7408 38.1651 10.6483 23.9297 2.3478 13.4631 3.0808 35.3680 3.6454 3.0189 15.0708 15.1017 12.7168 3.3653 10.7652 8.0001 13.4427 19.2665 14.6162 4.3127 3.7185 18.1931 4.7827 0.7901 12.2631 16.5550 74.4629 12.8463 252.5265 209.8144 19.0900 31.0426 47.1611 90.1923 82.0564 58.6398 29.5496 86.5676 81.6605 94.2166 63.3165 59.8073 26.9107 27.7139 42.3150 8.4918 83.6457 33.2677 42.8677 36.0228 24.9177 22.8472 28.3399 2.2805 689.3269 4.0699
temp: 298.150 k
press: 1.00000 atm
elementType: 8 8 8 7 7 6 6 6 6 6 6 6 6 6 6 6 6 6 6 6 1 1 1 1 1 1 1 1 1 1 1 1 1 1 1 1 1 1 1 1 1 1 1 1
symmnumber: 1
zpe: 983543.3 jmol-1
zpe.correction: 0.374612 hartree
zpe.thermalcorrener: 0.394828 hartree
zpe.thermalcorrenthalpy: 0.395772 hartree
zpe.thermalcorrgfe: 0.324359 hartree
zpe.sumelectzpe: -919.546374 hartree
zpe.sumelectthermal: -919.526157 hartree
zpe.sumelectthermalent: -919.525213 hartree
zpe.sumelectthermalfe: -919.596626 hartree
dipole: -0.8640 3.5321 0.7950
dipole: 3.7222
quadrupole: -115.6851 -118.1792 -125.6934
quadrupole: 2.4568 -6.3831 8.5415
quadrupole: 4.1674 1.6734 -5.8408 2.4568 -6.3831 8.5415
hfenergy: -919.9209854 hartree
pointgroup: C01 [X(C15H24N2O3)]
dipole: 0.0968823 1.4049702 -0.4014753 debye
polarizability: 232.2247665|8.3977595|190.1644173|-42.4622841|-18.7688809|152.1418197 unknown
InChI: InChI=1S/C15H24N2O3/c1-19-15-4-2-13(3-5-15)16-7-6-14(18)12-17-8-10-20-11-9-17/h2-5,14,16,18H,6-12H2,1H3
charge 0 multiplicity 1
44 atoms
O  3.826696 -2.532532 -1.048547
O  2.668927 3.594166 0.676999
O  -4.537612 -1.560305 2.063654
N  2.593318 -0.02558 -0.190187
N  -0.17198 0.377316 -1.010366
C  2.538694 1.235691 0.609102
C  2.138407 2.50616 -0.178669
C  2.683801 -1.212021 0.718484
C  3.741815 -0.053209 -1.146179
C  0.628191 2.718013 -0.435293
C  2.701808 -2.512301 -0.100523
C  3.735413 -1.367846 -1.94217
C  0.014038 1.747134 -1.485755
C  -1.272222 -0.023078 -0.234502
C  -2.401016 0.804945 0.025793
C  -1.292265 -1.349193 0.305575
C  -3.50421 0.330832 0.77619
C  -2.378382 -1.8176 1.059114
C  -3.497897 -0.981637 1.299531
C  -5.714208 -0.731428 2.308239
H  3.527168 1.451312 1.076909
H  1.811363 1.089722 1.428564
H  2.664656 2.529234 -1.159494
H  3.605041 -1.160395 1.346547
H  1.807493 -1.209751 1.393675
H  4.710399 0.043047 -0.598426
H  3.662626 0.796439 -1.847953
H  0.494482 3.757192 -0.811026
H  0.073273 2.640463 0.519204
H  1.744919 -2.62474 -0.656638
H  2.84835 -3.387411 0.553288
H  4.615507 -1.432023 -2.602719
H  2.808003 -1.433153 -2.552187
H  0.677672 1.716889 -2.373877
H  -0.951783 2.149487 -1.840683
H  2.289366 4.456053 0.368768
H  0.734384 -0.104381 -0.846516
H  -2.434904 1.831755 -0.352761
H  -0.449408 -2.021618 0.102049
H  -4.352191 1.002075 0.946779
H  -2.387396 -2.835242 1.462653
H  -5.45759 0.18075 2.88419
H  -6.20822 -0.437119 1.360173
H  -6.396324 -1.360612 2.899791
