program: Gaussian 09
title: 000290363
version: EM64L-G09RevD.01
frameworkgroup: C1[X(C13H20N2O)]
method: RPBEPBE
basis: SDD
operation: Freq
keyword: #p
keyword: freq=noraman
keyword: PBEPBE/SDD
title: #p freq=noraman PBEPBE/SDD
converged: YES YES NO NO
title: Mulliken charges:
elementType: O N N C C C C C C C C C C C C C H H H H H H H H H H H H H H H H H H H H
charge: -0.461600 -0.091575 -0.417161 -0.437182 -0.428759 -0.440099 -0.438870 -0.358699 -0.150677 -0.376503 0.462945 -0.364136 -0.433997 -0.224036 -0.196128 -0.279428 0.212609 0.240066 0.209850 0.233153 0.217130 0.224379 0.225374 0.220837 0.222297 0.224753 0.206096 0.246748 0.204444 0.301697 0.346308 0.231451 0.215682 0.214882 0.216373 0.221775
chargesum: 0.00000
title: Mulliken charges with hydrogens summed into heavy atoms:
elementType: O N N C C C C C C C C C C C C C
charge: -0.115291 -0.091575 -0.115465 0.015493 0.014244 0.001410 0.007341 0.088352 0.055419 0.074688 0.462945 -0.132685 -0.218315 -0.009153 0.020245 -0.057654
polarizability: 1.96611231e+02 -2.26861282e+01 1.33554788e+02 -9.43197002e+00 -8.45736962e+00 1.37773204e+02
1716.lowfreq: -12.4075 -0.0004 0.0004 0.0005 5.2675 8.6817 13.1199 33.3370 40.9864
frequency: 8.3573 33.1967 40.8316 42.5916 70.3154 108.9405 115.1273 142.3304 184.5594 223.3839 237.9914 313.6123 326.1435 393.3691 409.3087 413.0127 421.2176 426.2909 506.9904 523.3011 582.1831 608.1835 614.0278 638.8274 661.7270 690.8807 753.0247 765.6274 814.1703 825.1560 831.2708 845.2822 857.2034 867.5170 877.7514 906.3426 914.9405 936.9822 952.8643 970.3068 972.3821 977.7483 1019.2992 1023.3726 1039.0310 1051.7411 1058.2015 1077.5854 1082.5436 1103.7637 1147.9444 1167.4536 1170.7971 1184.0471 1189.2101 1199.2707 1216.2444 1239.6438 1247.2908 1258.3763 1283.7016 1284.5456 1296.4711 1314.7821 1320.0462 1326.3157 1328.1965 1345.5161 1354.1352 1386.3512 1391.9491 1431.8778 1456.9328 1464.4830 1473.3937 1475.2878 1477.4803 1486.0223 1488.5351 1509.6160 1586.1047 1626.6596 2887.9992 2930.2182 2979.9344 2984.8584 2992.8437 3003.8550 3012.6820 3018.3696 3051.3256 3055.5471 3068.1680 3079.3276 3090.2576 3108.4191 3121.1669 3134.2909 3151.1574 3164.8222 3520.3360 3559.6922
redmass: 3.9546 2.6466 3.2886 3.3708 2.7869 2.7885 4.8215 3.4850 3.7223 4.3104 3.3552 2.5770 1.1150 1.8790 2.9883 3.8895 3.1724 2.4518 2.6836 2.8912 1.3224 2.1146 6.2480 3.9850 3.9328 1.8300 1.8113 1.5557 1.2919 2.2398 3.5643 2.7314 2.0219 1.5611 3.5181 2.5439 2.4396 1.5689 1.3630 1.2929 2.5299 4.3798 2.5722 2.2352 2.0378 2.5134 2.2159 1.7969 1.6193 1.6740 2.9048 1.0528 1.2750 1.1443 1.2140 1.1335 1.2466 1.3356 1.2876 1.3576 1.4690 1.3080 1.3076 1.2005 1.6121 1.3570 1.4101 1.4282 1.4697 3.9863 1.5891 2.3111 1.0803 1.0828 1.0802 1.5567 1.0910 1.2099 1.0973 2.8864 5.3379 6.2597 1.0703 1.0678 1.0850 1.0669 1.0633 1.0591 1.0886 1.0642 1.0992 1.0962 1.1024 1.1003 1.1053 1.0865 1.0860 1.0931 1.0934 1.1005 1.0758 1.0661
irintensity: 0.0974 0.1595 0.6135 0.1328 0.3215 1.2363 6.6825 2.8066 6.4091 4.5112 6.8929 10.8652 130.4187 6.2413 1.7091 7.9512 1.6574 8.8711 13.0763 65.0273 147.0406 2.2717 0.8563 0.7171 6.6599 45.8332 81.7935 18.9849 0.5673 10.4310 4.0517 4.2382 6.7098 10.9648 13.6562 0.8974 29.7083 11.0375 0.1430 1.1672 12.0628 10.5455 12.4660 12.0167 14.1722 43.3156 43.3846 14.3956 11.6511 12.3513 9.7549 1.4937 1.7786 11.7402 5.3834 57.7706 3.2069 29.5104 5.4434 6.9362 1.1688 4.4116 3.2397 1.9904 12.8586 0.2764 23.1525 35.9962 11.6487 28.8086 22.6876 9.7769 15.7993 0.4432 11.9896 15.4411 7.3901 44.2576 10.2957 224.3787 12.0630 226.6005 89.9977 53.0617 52.5291 48.0929 42.4743 46.5700 11.3110 55.2352 11.2801 26.0429 2.8080 27.9531 95.1774 14.4942 3.6940 34.1070 44.4519 13.6658 74.2181 5.6732
temp: 298.150 k
press: 1.00000 atm
elementType: 8 7 7 6 6 6 6 6 6 6 6 6 6 6 6 6 1 1 1 1 1 1 1 1 1 1 1 1 1 1 1 1 1 1 1 1
symmnumber: 1
zpe: 815283.5 jmol-1
zpe.correction: 0.310525 hartree
zpe.thermalcorrener: 0.326450 hartree
zpe.thermalcorrenthalpy: 0.327394 hartree
zpe.thermalcorrgfe: 0.263782 hartree
zpe.sumelectzpe: -690.845326 hartree
zpe.sumelectthermal: -690.829401 hartree
zpe.sumelectthermalent: -690.828457 hartree
zpe.sumelectthermalfe: -690.892069 hartree
dipole: -2.8629 1.1438 0.8296
dipole: 3.1926
quadrupole: -97.7036 -92.6547 -93.9667
quadrupole: 1.8065 -3.1065 2.3750
quadrupole: -2.9286 2.1203 0.8083 1.8065 -3.1065 2.3750
hfenergy: -691.155851 hartree
pointgroup: C01 [X(C13H20N2O1)]
dipole: 1.1048367 -0.4147256 0.430168 debye
polarizability: 195.6364318|-21.5642837|132.8867284|14.608685|7.014762|139.4160628 unknown
InChI: InChI=1S/C13H20N2O/c16-13(11-15-8-4-5-9-15)10-14-12-6-2-1-3-7-12/h1-3,6-7,13-14,16H,4-5,8-11H2
charge 0 multiplicity 1
36 atoms
O  1.025647 -2.859756 -0.341224
N  2.453961 0.463137 0.5774
N  -1.039849 -0.971576 -0.257025
C  2.655157 1.753794 -0.141826
C  3.76426 0.23749 1.26124
C  4.102663 1.693261 -0.722894
C  4.883208 0.837793 0.327123
C  2.028151 -0.668651 -0.287303
C  1.181521 -1.667402 0.527914
C  -0.193239 -1.090999 0.92693
C  -2.26872 -0.309937 -0.279369
C  -2.751183 0.430588 0.841758
C  -3.075515 -0.35664 -1.458418
C  -3.989989 1.103451 0.770772
C  -4.310551 0.316172 -1.511136
C  -4.782737 1.056433 -0.398695
H  2.580817 2.57921 0.593244
H  1.870952 1.904817 -0.901801
H  3.911155 -0.837527 1.46606
H  3.757277 0.768035 2.231905
H  4.541738 2.696424 -0.864048
H  4.093567 1.188091 -1.70604
H  5.473903 0.044159 -0.162521
H  5.585398 1.457336 0.912797
H  2.877836 -1.228269 -0.738675
H  1.407593 -0.277889 -1.113407
H  1.730395 -1.936743 1.454618
H  -0.000138 -0.0986 1.378603
H  -0.663746 -1.732788 1.709969
H  -0.82737 -1.636691 -1.004899
H  0.617803 -3.593806 0.184973
H  -2.163138 0.479164 1.763788
H  -2.719664 -0.920617 -2.330565
H  -4.339446 1.667685 1.643925
H  -4.909514 0.264315 -2.428254
H  -5.743603 1.579434 -0.444019
