program: Gaussian 09
title: 000290352
version: EM64L-G09RevD.01
frameworkgroup: C1[X(C16H16N2OS)]
method: RPBEPBE
basis: SDD
operation: Freq
keyword: #p
keyword: freq=noraman
keyword: PBEPBE/SDD
title: #p freq=noraman PBEPBE/SDD
converged: YES YES NO NO
title: Mulliken charges:
elementType: S O N N C C C C C C C C C C C C C C C C H H H H H H H H H H H H H H H H
charge: 0.207882 -0.428824 -0.203109 -0.021169 -0.496178 0.008074 -0.721736 -0.257667 0.464519 -0.359295 -0.368333 -0.213855 -0.215512 0.261333 -0.249372 -0.389161 -0.348390 -0.202635 -0.211067 -0.257584 0.262540 0.261054 0.243956 0.270051 0.277746 0.340986 0.252643 0.236000 0.229149 0.227925 0.231769 0.249919 0.246516 0.224290 0.221817 0.225720
chargesum: 0.00000
title: Mulliken charges with hydrogens summed into heavy atoms:
elementType: S O N N C C C C C C C C C C C C C C C C
charge: 0.207882 -0.087838 -0.203109 -0.021169 0.027416 0.252030 -0.173939 -0.257667 0.464519 -0.106652 -0.132334 0.015294 0.012413 0.261333 -0.017603 -0.139242 -0.101874 0.021654 0.010750 -0.031864
polarizability: 2.90943526e+02 -1.82838804e+00 2.16169205e+02 1.28338093e+01 -6.37188273e+00 1.52399845e+02
1716.lowfreq: -5.3336 -1.6861 0.0009 0.0015 0.0021 5.0420 25.2257 35.4381 39.9186
frequency: 24.9450 35.4323 39.8526 45.3085 50.6957 83.9298 113.7305 139.8462 187.2901 201.4546 220.7496 270.2411 310.3029 356.3164 367.1044 368.0531 384.7627 396.5631 406.3225 408.8678 431.8478 489.6546 504.7602 538.9693 548.0956 603.6554 611.4237 614.0246 618.8108 667.4015 693.5864 694.0000 697.9274 754.3600 762.9142 773.7884 800.4431 823.9568 833.3663 834.5555 901.3146 902.7750 918.9399 926.2443 964.7681 965.8965 983.7895 984.5833 985.8563 989.9682 1016.9117 1018.0526 1023.3505 1037.7472 1076.7297 1084.6966 1103.4358 1132.5752 1147.5983 1168.1532 1172.6184 1179.7311 1189.2233 1211.9466 1225.4500 1267.2363 1269.9859 1303.8777 1309.1362 1323.4256 1336.7593 1365.2217 1371.4634 1372.7834 1382.9532 1436.6352 1437.6899 1441.3898 1447.7281 1474.6802 1481.9834 1575.9901 1591.1338 1602.7728 1608.0556 1664.0506 3014.5986 3033.6798 3062.7354 3108.2665 3119.1028 3123.2700 3129.0595 3132.4174 3136.7644 3149.9238 3149.9656 3157.9139 3160.5594 3168.6719 3172.1104 3531.7984
redmass: 4.1464 6.9251 5.3118 5.1888 4.0093 3.8619 5.2402 4.0717 4.1935 5.2184 5.0522 7.8809 3.3658 1.7106 3.8149 3.4656 3.3062 3.2054 2.8817 2.9131 4.0965 5.0144 3.3829 4.4129 4.2562 7.1089 5.3119 6.4611 6.4725 4.3436 1.9513 2.0056 4.3184 2.2287 1.8407 2.8221 4.2177 3.6474 1.2623 1.3141 1.5069 1.4538 1.9443 2.4074 1.3733 1.3777 2.2416 2.0632 2.4785 1.8977 3.1612 3.1245 2.1792 2.2787 1.5481 1.6387 1.5310 2.9301 1.8191 1.0578 1.0504 1.1312 1.1236 1.3560 1.4522 1.9645 2.0319 1.5239 1.4348 1.4290 1.6324 1.3737 5.6814 1.2172 6.3468 1.1024 2.4085 2.2663 1.1152 2.3517 2.3055 6.0840 6.3291 6.3211 6.1322 11.5757 1.0653 1.0608 1.0867 1.0983 1.1050 1.0845 1.0848 1.0885 1.0882 1.0930 1.0928 1.0959 1.0961 1.1008 1.1009 1.0659
irintensity: 0.1915 0.4793 0.0141 0.4238 0.7605 5.1868 3.4856 0.3348 4.3670 0.6554 0.3031 7.9385 0.5736 50.3712 32.1877 19.4219 14.5107 12.1315 0.6341 0.8515 4.5761 10.7760 18.4421 9.5898 19.4375 4.1168 9.2139 1.9360 1.6390 7.7354 37.7727 31.7295 9.0557 27.6873 72.0780 29.7665 43.9065 20.2951 3.9797 2.6632 4.0028 4.1255 15.5857 35.3953 0.3178 0.1086 1.9511 1.6110 0.4719 0.4438 140.0622 32.7268 23.9259 77.9716 14.0204 7.5223 9.6433 86.6924 38.1712 0.5605 0.3456 1.2599 1.8247 36.0510 39.7359 45.4397 12.2735 36.7080 13.7523 0.2565 112.4107 10.5676 1.3967 27.5458 1.1253 11.6229 2.1407 5.4468 25.6486 31.4032 105.2504 16.1710 4.0998 227.1618 34.1043 770.5231 18.0402 16.7195 32.0851 5.9302 10.7681 4.5924 3.8373 10.8233 3.6889 26.6878 33.8677 24.6037 29.8853 15.6104 8.0047 10.2805
temp: 298.150 k
press: 1.00000 atm
elementType: 16 8 7 7 6 6 6 6 6 6 6 6 6 6 6 6 6 6 6 6 1 1 1 1 1 1 1 1 1 1 1 1 1 1 1 1
symmnumber: 1
zpe: 744301.3 jmol-1
zpe.correction: 0.283489 hartree
zpe.thermalcorrener: 0.301280 hartree
zpe.thermalcorrenthalpy: 0.302224 hartree
zpe.thermalcorrgfe: 0.235520 hartree
zpe.sumelectzpe: -1200.637626 hartree
zpe.sumelectthermal: -1200.619835 hartree
zpe.sumelectthermalent: -1200.618891 hartree
zpe.sumelectthermalfe: -1200.685594 hartree
dipole: -1.6655 0.1142 0.3660
dipole: 1.7090
quadrupole: -124.0192 -121.9160 -117.2618
quadrupole: -5.7876 6.8246 0.1435
quadrupole: -2.9535 -0.8503 3.8038 -5.7876 6.8246 0.1435
hfenergy: -1200.9211149 hartree
pointgroup: C01 [X(C16H16N2O1S1)]
dipole: -0.6520341 -0.0818503 0.1423482 debye
polarizability: 286.8950656|18.1612329|216.0617797|14.8193617|-14.4951465|156.555731 unknown
InChI: InChI=1S/C16H16N2OS/c19-15-11-18(14-9-5-2-6-10-14)16(20-12-15)17-13-7-3-1-4-8-13/h1-10,15,19H,11-12H2
charge 0 multiplicity 1
36 atoms
S  1.279307 -2.511894 0.015411
O  -2.521654 -3.368958 1.364574
N  -1.030468 -1.037325 -0.359489
N  0.942896 0.260298 -0.537055
C  -1.569195 -2.371961 -0.731964
C  -1.409881 -3.415906 0.401303
C  -0.06131 -3.24774 1.136497
C  0.367093 -0.875813 -0.320697
C  -1.906154 0.112135 -0.30464
C  -1.728479 1.090653 0.7077
C  -2.96448 0.260152 -1.236391
C  -2.605432 2.190722 0.789527
C  -3.846977 1.359351 -1.139619
C  2.286647 0.638033 -0.33118
C  -3.674645 2.329283 -0.127763
C  2.898007 1.462775 -1.316537
C  3.019183 0.311279 0.847002
C  4.219752 1.921809 -1.14366
C  4.336179 0.787679 1.01669
C  4.948423 1.587793 0.023099
H  -1.058046 -2.739886 -1.640038
H  -2.643838 -2.272521 -0.946488
H  -1.493528 -4.422659 -0.041821
H  -0.179074 -2.560061 1.991161
H  0.333508 -4.207012 1.504261
H  -2.571335 -2.455415 1.750816
H  -0.900249 0.993693 1.415827
H  -3.088376 -0.459526 -2.052682
H  -2.456343 2.939567 1.575248
H  -4.660042 1.461524 -1.86684
H  -4.3564 3.183425 -0.057494
H  2.316554 1.730517 -2.204568
H  2.553213 -0.308959 1.619422
H  4.679112 2.548619 -1.916478
H  4.886735 0.532876 1.929773
H  5.972598 1.951654 0.159792
