program: Gaussian 09
title: 000290346
version: EM64L-G09RevD.01
frameworkgroup: C1[X(C24H16N2O2)]
method: RPBEPBE
basis: SDD
operation: Freq
keyword: #p
keyword: freq=noraman
keyword: PBEPBE/SDD
title: #p freq=noraman PBEPBE/SDD
converged: YES YES NO NO
title: Mulliken charges:
elementType: O O N N C C C C C C C C C C C C C C C C C C C C C C C C H H H H H H H H H H H H H H H H
charge: -0.188597 -0.194149 -0.355854 -0.043071 -0.033737 0.214234 0.269099 0.196791 0.449847 0.063934 0.021998 -0.677287 0.482413 0.016432 -0.347834 -0.454100 -0.254443 -0.344286 -0.346214 -0.235151 -0.276856 0.450509 -0.390414 -0.392246 -0.192787 -0.385905 -0.808559 -0.170727 0.276342 0.270055 0.253369 0.233812 0.269169 0.265175 0.235567 0.253293 0.231939 0.230812 0.241027 0.244788 0.225645 0.225932 0.237041 0.232993
chargesum: 0.00000
title: Mulliken charges with hydrogens summed into heavy atoms:
elementType: O O N N C C C C C C C C C C C C C C C C C C C C C C C C
charge: -0.188597 -0.194149 -0.355854 -0.043071 -0.033737 0.214234 0.269099 0.196791 0.449847 0.063934 0.021998 -0.400944 0.482413 0.016432 -0.077778 -0.200731 -0.020631 -0.075117 -0.081039 0.000416 -0.023564 0.450509 -0.158475 -0.161434 0.048241 -0.141117 -0.119941 0.062267
polarizability: 4.76316553e+02 2.09412908e+01 3.28197361e+02 -8.92001852e+00 -1.10470578e+01 1.43444009e+02
1716.lowfreq: -0.0004 0.0004 0.0007 4.0608 4.6881 7.2185 28.8437 34.0668 35.0756
frequency: 28.8055 34.0525 34.9356 48.3792 53.5526 57.2051 74.9345 94.1230 105.0852 132.4232 174.3692 198.0390 202.0225 212.6789 248.8989 253.7587 269.4814 301.6910 317.2602 322.6388 354.9794 366.7598 401.4446 404.9650 415.5745 443.9499 476.8234 491.4396 498.7858 514.9270 562.4884 572.5295 572.7283 602.6373 618.8188 632.1414 643.0074 653.8074 663.9627 710.2237 716.3355 732.7660 745.1521 766.1684 768.3339 771.7328 779.2724 800.1878 816.9920 822.5082 832.4192 838.3305 879.7848 894.5541 902.0309 930.7556 939.9264 947.4886 958.4096 961.6865 967.4251 973.0867 986.9985 998.4743 999.0569 1013.5043 1036.0099 1040.0131 1046.4499 1048.1549 1075.5123 1090.6392 1117.0594 1135.4568 1140.5659 1167.9254 1176.1700 1193.9747 1200.8384 1211.0840 1226.7342 1257.8539 1279.3449 1304.9142 1307.1970 1317.5990 1328.0645 1342.7138 1372.6685 1396.8165 1398.0316 1404.5677 1414.8616 1415.9398 1442.7825 1446.5363 1457.7990 1471.2637 1474.1277 1509.3145 1523.3966 1560.3131 1578.8421 1583.1934 1597.1318 1615.2280 1622.0797 1625.6577 1638.8167 1668.4844 2974.9060 3056.1990 3085.3446 3127.9858 3129.1545 3129.5343 3131.0530 3142.4066 3144.8719 3148.5199 3162.1802 3163.6942 3177.2303 3185.1321 3186.7081 3188.2901
redmass: 3.6040 2.1938 1.5745 4.9347 5.0674 4.6629 4.9825 4.9651 5.9640 5.9329 6.1466 6.0883 5.0415 5.8987 5.9698 5.6853 7.9446 4.4182 9.6904 4.5242 3.6701 5.1912 3.4957 2.8973 4.4817 3.6908 4.2195 6.0989 5.0549 2.8228 5.8457 8.0360 4.0135 7.3585 6.6861 6.3970 6.0558 5.2677 7.2533 3.3552 5.7002 4.9073 1.6749 3.2785 4.4262 1.9256 2.8726 4.2543 3.4597 1.6553 1.2723 5.0606 1.5581 2.0290 2.3923 5.7038 1.5848 1.3617 1.7123 4.0838 1.3817 1.4472 1.4369 1.3573 1.3504 3.0196 2.3828 2.7006 1.6316 4.9378 3.7453 1.9057 3.3044 1.3491 2.0927 1.0796 1.2198 1.4250 1.2713 2.1587 2.8806 2.6412 1.6278 6.1334 2.3175 1.2859 6.6113 3.3153 6.3238 1.2406 2.7278 2.9946 3.0727 3.3813 2.8750 2.5128 3.0124 1.1025 1.0541 2.6740 4.3813 5.6556 5.7774 6.4135 9.6059 7.6161 7.1539 7.4184 8.8073 12.7237 1.0387 1.0948 1.0998 1.0904 1.0866 1.0882 1.0906 1.0910 1.0897 1.0929 1.0976 1.0955 1.1008 1.0939 1.0951 1.0949
irintensity: 1.3512 0.5655 0.3489 0.4394 1.1786 2.0451 1.2859 0.1658 1.0320 0.6208 3.2424 2.6971 1.7876 1.7090 0.7217 1.6672 0.1624 0.8605 10.0004 0.7715 1.3944 0.2341 3.5715 0.1551 0.2431 9.1408 3.9627 12.8523 0.6339 15.6712 7.4731 18.9720 8.6440 7.3773 4.9497 3.7841 8.8533 5.6979 20.7878 1.4144 9.8091 1.5426 34.0179 17.8464 28.9504 53.0267 14.4951 2.3964 8.4852 46.7257 1.2676 3.1307 2.2012 14.0621 7.1021 8.7582 17.3509 4.9235 1.2170 6.8480 0.1335 6.9044 4.5084 0.8030 0.1719 4.4232 9.1343 6.4023 13.7059 80.2972 52.4134 6.5577 37.9843 24.3314 4.7836 0.6177 15.9322 66.3006 5.2538 51.8963 3.3536 1.2289 3.7495 5.2924 10.3282 2.0139 356.1048 36.4505 0.3567 8.5340 12.4100 13.1381 5.3796 57.7144 17.3125 3.5115 19.8409 15.7148 12.5181 153.8281 6.1229 9.8581 20.9859 19.4349 17.7289 205.8929 53.7863 91.4149 54.2377 107.2693 46.0054 22.9967 17.4212 19.8527 0.6111 13.5732 28.0067 12.1248 8.3146 1.2742 35.1355 35.3767 10.0143 2.8077 12.1913 0.1378
temp: 298.150 k
press: 1.00000 atm
elementType: 8 8 7 7 6 6 6 6 6 6 6 6 6 6 6 6 6 6 6 6 6 6 6 6 6 6 6 6 1 1 1 1 1 1 1 1 1 1 1 1 1 1 1 1
symmnumber: 1
zpe: 872706.0 jmol-1
zpe.correction: 0.332396 hartree
zpe.thermalcorrener: 0.354610 hartree
zpe.thermalcorrenthalpy: 0.355554 hartree
zpe.thermalcorrgfe: 0.279217 hartree
zpe.sumelectzpe: -1182.269513 hartree
zpe.sumelectthermal: -1182.247300 hartree
zpe.sumelectthermalent: -1182.246355 hartree
zpe.sumelectthermalfe: -1182.322693 hartree
dipole: -2.3651 1.5377 -1.6102
dipole: 3.2483
quadrupole: -129.7154 -145.3090 -162.4080
quadrupole: 5.1798 2.9580 -7.3312
quadrupole: 16.0954 0.5018 -16.5972 5.1798 2.9580 -7.3312
hfenergy: -1182.6019094 hartree
pointgroup: C01 [X(C24H16N2O2)]
dipole: 0.9348079 -0.6107275 -0.621553 debye
polarizability: 476.3682136|17.9082919|327.1288679|17.201459|14.2361101|144.4608407 unknown
InChI: InChI=1S/C24H16N2O2/c1-15-9-11-17(12-10-15)26-23(27)19-14-16-6-2-3-7-18(16)21(22(19)24(26)28)20-8-4-5-13-25-20/h2-14H,1H3
charge 0 multiplicity 1
44 atoms
O  -1.006111 -1.689042 0.007101
O  -1.838679 2.966889 -0.14395
N  -1.794057 0.565819 -0.072245
N  2.922593 -2.141923 1.086893
C  0.542169 0.265316 -0.056474
C  0.260886 1.66963 -0.082263
C  1.854758 -0.219176 0.010264
C  2.931391 0.763676 0.031996
C  2.623721 2.187107 -0.006253
C  -0.772469 -0.456738 -0.038263
C  -1.210525 1.88049 -0.103807
C  1.258814 2.62621 -0.059614
C  -3.209446 0.304625 -0.06952
C  2.153542 -1.688858 0.043845
C  4.311209 0.377724 0.066231
C  3.690175 3.142138 0.00318
C  5.331588 1.334453 0.066464
C  -4.087938 1.171186 0.627399
C  -3.733903 -0.814142 -0.762924
C  5.023612 2.728186 0.039392
C  1.659658 -2.559186 -0.961002
C  -6.020295 -0.195407 -0.070322
C  -5.474243 0.917829 0.61823
C  -5.122469 -1.056129 -0.751861
C  1.960694 -3.934921 -0.888193
C  3.194252 -3.476701 1.149712
C  -7.51796 -0.442894 -0.097583
C  2.73908 -4.41026 0.19123
H  1.012834 3.693486 -0.076308
H  4.563196 -0.683485 0.110723
H  3.439322 4.208772 -0.022498
H  6.378008 1.012006 0.092583
H  -3.692836 2.038758 1.160239
H  -3.063384 -1.496912 -1.288688
H  5.832652 3.46628 0.044799
H  1.048739 -2.163325 -1.776377
H  -6.142491 1.597252 1.160628
H  -5.514255 -1.92984 -1.286248
H  1.586747 -4.622251 -1.6539
H  3.799936 -3.797213 2.005213
H  -7.75012 -1.517657 -0.198852
H  -8.006936 -0.072179 0.820512
H  -7.990494 0.077481 -0.953642
H  2.988037 -5.471376 0.291652
