program: Gaussian 09
title: 000290345
version: EM64L-G09RevD.01
frameworkgroup: C1[X(C16H13NO3)]
method: RPBEPBE
basis: SDD
operation: Freq
keyword: #p
keyword: freq=noraman
keyword: PBEPBE/SDD
title: #p freq=noraman PBEPBE/SDD
converged: NO YES NO NO
title: Mulliken charges:
elementType: O O O N C C C C C C C C C C C C C C C C H H H H H H H H H H H H H
charge: -0.237616 -0.163086 -0.173312 -0.158126 -0.048428 -0.139401 -0.364511 -0.421960 -0.098154 0.173075 0.198204 -0.553642 -0.297987 -0.182377 -0.262727 -0.154556 0.077655 0.084204 -0.202297 -0.274961 0.248983 0.251605 0.271997 0.292865 0.249662 0.234141 0.229263 0.249404 0.237390 0.227890 0.240877 0.233987 0.231937
chargesum: 0.00000
title: Mulliken charges with hydrogens summed into heavy atoms:
elementType: O O O N C C C C C C C C C C C C C C C C
charge: -0.237616 -0.163086 -0.173312 -0.158126 0.200554 0.112205 -0.092514 -0.129095 0.151507 0.173075 0.198204 -0.090238 -0.048583 0.055012 -0.034836 0.086321 0.077655 0.084204 0.031690 -0.043023
polarizability: 1.87114868e+02 1.25772707e+01 2.07633837e+02 1.67562958e+00 2.31124679e+00 1.84149249e+02
1716.lowfreq: -3.5499 -0.0010 -0.0009 -0.0007 6.3041 14.4754 48.3107 69.8737 82.2737
frequency: 48.2919 69.8719 82.2640 101.6646 159.8529 167.7226 173.2923 221.2933 272.5240 293.9336 337.9049 350.2135 372.8642 398.9340 424.4549 445.6651 454.5947 498.9737 521.0942 574.4313 585.3725 598.5021 617.5825 623.3281 632.7331 682.0868 696.4716 701.4096 712.9031 725.5099 729.6046 747.6341 755.4415 769.3001 781.2451 830.9612 847.7909 911.4593 912.0948 915.3433 932.1907 939.5798 967.4634 980.4261 983.6230 997.8080 1016.7546 1030.2376 1056.8961 1068.2762 1092.2854 1113.0373 1122.4754 1137.9207 1145.2637 1164.9560 1188.1541 1192.3362 1204.7782 1220.0303 1231.4871 1235.8217 1252.3347 1289.6492 1302.6131 1311.3555 1335.0692 1340.1958 1354.1494 1378.5461 1388.8919 1411.8203 1433.2573 1461.1676 1564.2788 1567.8159 1584.7287 1639.4531 1673.5792 1714.5866 2913.2245 2921.1262 2964.2679 2985.2321 3060.0945 3078.5833 3081.5396 3128.4677 3144.3606 3153.3533 3154.8666 3183.9343 3191.5270
redmass: 7.3021 7.2760 5.1746 4.3786 6.6074 2.8779 12.6524 6.2083 4.5726 6.9704 3.7012 3.8394 4.0724 3.2974 6.6246 4.4127 4.9971 4.1472 4.1497 5.1595 9.3328 5.5942 5.2839 3.9970 4.3865 4.7849 5.3743 1.6166 1.9486 4.6094 5.6518 5.9409 4.5539 1.8453 4.1835 3.6350 2.6209 2.0709 2.1715 2.2160 1.4185 3.3797 1.2940 3.3321 2.9796 3.5746 3.3789 3.0207 1.9292 1.7142 1.4721 1.5234 1.6800 1.8606 2.3984 1.2497 1.2197 1.3176 1.4958 1.5869 1.4685 1.7774 1.5833 2.1539 1.7425 1.7396 1.8806 1.3437 1.6191 1.7896 1.7411 1.1895 2.0778 1.1086 6.5871 5.9753 8.4449 5.9226 13.0647 12.9446 1.0840 1.0804 1.0679 1.0807 1.0967 1.0882 1.0891 1.0855 1.0894 1.0873 1.0976 1.1067 1.0984
irintensity: 1.4024 0.6343 0.6860 2.2768 1.0217 0.6054 1.1438 1.1370 0.1660 2.3717 0.2167 3.9549 5.0579 1.2815 1.2614 3.7225 18.9751 47.5722 9.5183 12.0293 37.6557 5.2247 2.4978 13.8664 9.1831 7.5693 29.6778 34.0263 93.1453 36.4533 49.4097 16.9716 1.8040 4.5309 8.8377 21.2074 14.0153 31.3241 7.2753 15.1292 0.6218 4.7557 1.6576 27.2863 1.5510 36.4211 29.0913 1.5968 8.9068 28.0638 6.3828 4.1357 2.0510 38.8628 7.8269 38.1021 0.8766 17.5337 36.2889 18.7907 24.1827 53.5218 4.4112 27.2245 6.0735 2.4356 13.4084 15.0552 5.5981 30.4922 2.8779 3.5793 4.8573 8.4231 83.5724 2.0614 95.6573 27.6047 462.0172 360.7816 33.5574 11.3606 18.8799 16.4828 25.5612 13.7578 1.1012 3.1473 3.2768 1.9900 26.4550 28.0544 9.3938
temp: 298.150 k
press: 1.00000 atm
elementType: 8 8 8 7 6 6 6 6 6 6 6 6 6 6 6 6 6 6 6 6 1 1 1 1 1 1 1 1 1 1 1 1 1
symmnumber: 1
zpe: 662327.4 jmol-1
zpe.correction: 0.252267 hartree
zpe.thermalcorrener: 0.267105 hartree
zpe.thermalcorrenthalpy: 0.268049 hartree
zpe.thermalcorrgfe: 0.210686 hartree
zpe.sumelectzpe: -896.422128 hartree
zpe.sumelectthermal: -896.407290 hartree
zpe.sumelectthermalent: -896.406346 hartree
zpe.sumelectthermalfe: -896.463709 hartree
dipole: -5.4587 4.8039 -0.5737
dipole: 7.2941
quadrupole: -115.0703 -127.5484 -117.0911
quadrupole: 16.2881 -1.9037 1.4576
quadrupole: 4.8330 -7.6452 2.8122 16.2881 -1.9037 1.4576
hfenergy: -896.674395 hartree
pointgroup: C01 [X(C16H13N1O3)]
dipole: -1.8416271 -2.1988598 0.0939618 debye
polarizability: 191.2419792|-14.8620706|203.1295722|-3.0078043|3.3494497|184.5264016 unknown
InChI: InChI=1S/C16H13NO3/c18-15-12-11-8-4-3-5-9(8)14(13(12)16(19)20-15)17-7-2-1-6-10(11)17/h1-4,6-11,14H,5H2
charge 0 multiplicity 1
33 atoms
O  1.657972 2.715785 0.027689
O  1.607271 2.299467 -2.303167
O  1.322007 2.432783 2.348441
N  0.34703 -1.355862 0.790748
C  -1.888045 -0.483281 0.719829
C  -1.892806 0.00467 -0.755793
C  -0.443784 -0.200764 -1.338695
C  -0.487542 -0.19128 1.332956
C  0.15118 -1.574523 -0.69245
C  0.305091 0.926122 -0.698885
C  0.205166 0.981645 0.676969
C  -3.315164 -0.091312 1.175726
C  -3.25489 -0.530377 -1.197038
C  -4.078677 -0.503578 -0.104181
C  1.399407 -2.092667 -1.364904
C  1.528604 -1.716184 1.435725
C  1.218482 1.981048 -1.17094
C  1.070801 2.065114 1.191258
C  2.518172 -2.461117 -0.665987
C  2.581341 -2.318959 0.782867
H  -1.932316 -1.590848 0.696418
H  -2.023436 1.110103 -0.740312
H  -0.380479 -0.23775 -2.437291
H  -0.4471 -0.186324 2.433534
H  -0.680023 -2.298289 -0.840767
H  -3.420472 0.999133 1.359776
H  -3.66237 -0.623699 2.078152
H  -3.555467 -0.741982 -2.226755
H  -5.154872 -0.701264 -0.113272
H  1.362815 -2.166764 -2.458017
H  1.55449 -1.492977 2.50773
H  3.390999 -2.850612 -1.201342
H  3.455715 -2.649758 1.346977
