program: Gaussian 09
title: 000290334
version: EM64L-G09RevD.01
frameworkgroup: C1[X(C10H14N2O5)]
method: RPBEPBE
basis: SDD
operation: Freq
keyword: #p
keyword: freq=noraman
keyword: PBEPBE/SDD
title: #p freq=noraman PBEPBE/SDD
converged: YES YES NO NO
title: Mulliken charges:
elementType: O O O O O N N C C C C C C C C C C H H H H H H H H H H H H H H
charge: -0.197995 -0.260387 -0.216308 -0.262782 -0.252649 -0.268132 -0.392368 0.224015 -0.552036 0.137707 -0.693835 0.260091 0.266464 0.270600 -0.744397 -0.262653 -0.661211 0.306747 0.274700 0.264477 0.242167 0.226234 0.356921 0.249449 0.262754 0.258248 0.228329 0.235354 0.219806 0.250412 0.230277
chargesum: 0.00000
title: Mulliken charges with hydrogens summed into heavy atoms:
elementType: O O O O O N N C C C C C C C C C C
charge: -0.197995 -0.260387 -0.216308 -0.262782 -0.252649 -0.268132 -0.035447 0.224015 0.029411 0.137707 0.039043 0.260091 0.266464 0.270600 0.026053 0.201030 0.039284
polarizability: 1.36197545e+02 8.62320238e+00 1.31961938e+02 1.11582865e+01 -3.74855914e-01 1.30961134e+02
1716.lowfreq: -4.6437 0.0004 0.0008 0.0009 3.6696 10.1315 23.7326 36.5263 55.6145
frequency: 23.6267 36.5151 55.6134 71.6670 76.7336 96.2389 111.6943 156.0841 171.4285 190.7127 197.4587 220.3548 223.9996 234.9676 262.7651 283.2881 298.3125 322.1239 340.0069 370.5067 412.0099 448.6355 480.1705 549.9643 572.6357 594.3781 609.7475 648.5744 658.1086 667.8563 671.8785 714.8615 746.1476 775.5223 798.5456 822.6154 891.2044 922.2930 960.3183 970.2880 1014.1295 1039.8537 1040.6268 1061.7857 1095.2828 1101.4846 1108.5506 1154.1422 1161.0329 1178.8833 1227.3076 1269.9305 1276.5830 1293.9936 1316.2565 1331.7589 1335.4466 1358.7375 1384.8402 1390.2297 1392.0465 1421.8895 1431.9327 1449.1160 1458.8773 1463.9175 1467.1172 1483.2517 1484.0015 1605.0815 1632.9398 1682.7521 1711.1066 2994.1398 2999.9254 3009.0416 3021.4762 3033.4217 3089.4532 3090.9044 3095.7783 3096.1254 3100.1159 3120.0640 3122.9671 3137.1026 3579.1397
redmass: 4.7115 3.2522 7.5465 5.5724 4.0080 4.9701 4.8082 1.0662 3.6730 4.0138 3.1877 2.8829 1.4462 1.2132 2.9344 2.7856 4.4970 3.4680 7.5838 4.6228 3.5225 5.7193 4.0927 3.2906 4.4163 3.4100 7.1953 1.8223 3.8890 2.5973 4.5903 7.3262 4.6498 3.0199 1.5475 2.4147 3.2016 2.9705 1.8640 1.8026 2.7700 1.8967 1.8113 4.4624 2.2193 2.5793 3.4213 2.0495 2.8391 2.2358 2.4753 3.0091 1.1282 6.1233 3.2587 1.7695 1.7913 1.4102 1.2275 1.2286 1.2325 1.1024 1.0843 1.0455 1.0936 1.0448 1.0652 1.0514 1.0519 7.6450 8.6271 7.7007 12.2876 1.0361 1.0350 1.0364 1.0623 1.0600 1.0973 1.0978 1.0961 1.1026 1.1004 1.1015 1.1066 1.1025 1.0801
irintensity: 0.5818 0.1249 0.5724 0.3433 4.2918 4.1411 1.8453 0.0660 3.8737 3.1006 4.7529 10.6841 0.9208 0.1004 2.7284 2.1679 3.0724 24.6372 10.1717 0.0469 6.3619 8.6777 6.5305 2.5221 43.8591 7.8955 6.1177 52.5451 9.9177 32.8267 7.3053 7.0445 89.1511 0.5068 7.1018 7.1146 6.5678 24.2603 8.9827 7.4735 80.5592 9.6530 6.2180 46.6101 39.1285 48.9128 25.6592 64.2902 234.0674 49.8352 42.5184 19.2210 5.5600 171.1550 363.8641 93.0419 106.4414 24.3914 35.7151 52.9858 21.7015 55.2443 29.9464 18.1553 11.9174 14.4033 18.6429 8.4536 11.4740 70.1688 188.3800 690.8299 98.6039 17.1789 12.4114 0.9344 5.1949 25.7003 31.5253 2.9885 3.2938 1.7269 17.1564 2.9490 30.0026 12.6531 78.5910
temp: 298.150 k
press: 1.00000 atm
elementType: 8 8 8 8 8 7 7 6 6 6 6 6 6 6 6 6 6 1 1 1 1 1 1 1 1 1 1 1 1 1 1
symmnumber: 1
zpe: 627886.3 jmol-1
zpe.correction: 0.239149 hartree
zpe.thermalcorrener: 0.257024 hartree
zpe.thermalcorrenthalpy: 0.257968 hartree
zpe.thermalcorrgfe: 0.192318 hartree
zpe.sumelectzpe: -873.851073 hartree
zpe.sumelectthermal: -873.833198 hartree
zpe.sumelectthermalent: -873.832254 hartree
zpe.sumelectthermalfe: -873.897904 hartree
dipole: 1.1897 -0.3541 0.2054
dipole: 1.2581
quadrupole: -87.0626 -104.5587 -104.4905
quadrupole: -7.2577 -4.1526 2.5717
quadrupole: 11.6413 -5.8547 -5.7866 -7.2577 -4.1526 2.5717
hfenergy: -874.090222 hartree
pointgroup: C01 [X(C10H14N2O5)]
dipole: -0.4507406 0.1489668 -0.140171 debye
polarizability: 124.7840579|-3.258815|140.2978444|8.9922341|-7.371376|134.038714 unknown
InChI: InChI=1S/C10H14N2O5/c1-4-17-7(14)5-10(3)8(15)11-9(16)12(10)6(2)13/h11H,4-5H2,1-3H3
charge 0 multiplicity 1
31 atoms
O  1.587572 2.26474 -0.283543
O  -2.717451 0.66539 -0.986677
O  1.594506 -1.475299 2.549615
O  0.115749 -2.766376 -1.283945
O  -1.32214 0.611005 0.882836
N  0.956403 -1.234513 0.234831
N  1.783021 0.555958 1.34887
C  0.971766 -0.112866 -0.767279
C  -0.414954 0.192277 -1.382057
C  1.463077 1.079306 0.094888
C  2.006727 -0.371976 -1.892463
C  1.449073 -0.808932 1.502747
C  0.504339 -2.537184 -0.103105
C  -1.492726 0.503307 -0.35608
C  0.503754 -3.597038 0.978706
C  -3.883452 1.036111 -0.117821
C  -3.954775 2.554399 0.061325
H  -0.735793 -0.654829 -2.010405
H  -0.306373 1.074015 -2.040859
H  1.671041 -1.208639 -2.525109
H  2.111599 0.539144 -2.506009
H  2.994029 -0.620268 -1.465425
H  2.107622 1.113308 2.140251
H  0.113892 -4.525248 0.535266
H  -0.118144 -3.292338 1.837809
H  1.516398 -3.763024 1.383879
H  -4.749521 0.639246 -0.670119
H  -3.775607 0.518333 0.851201
H  -4.862737 2.818714 0.634545
H  -3.07796 2.926715 0.617281
H  -4.002632 3.065262 -0.915656
