program: Gaussian 09
title: 000290331
version: EM64L-G09RevD.01
frameworkgroup: C1[X(C17H20N2O3)]
method: RPBEPBE
basis: SDD
operation: Freq
keyword: #p
keyword: freq=noraman
keyword: PBEPBE/SDD
title: #p freq=noraman PBEPBE/SDD
converged: NO YES NO NO
title: Mulliken charges:
elementType: O O O N N C C C C C C C C C C C C C C C C C H H H H H H H H H H H H H H H H H H H H
charge: -0.213784 -0.248366 -0.267313 -0.239143 -0.404512 -0.129239 -0.189184 0.230662 -0.518221 -0.421990 -0.458039 0.323867 -0.569513 0.116530 0.328408 -0.722677 0.176501 -0.407828 -0.558097 -0.400443 0.325205 -0.536120 0.266328 0.229637 0.240615 0.228920 0.233217 0.212842 0.226360 0.210291 0.233770 0.229514 0.257900 0.231005 0.220308 0.346474 0.231035 0.258004 0.241359 0.220685 0.245299 0.219730
chargesum: 0.00000
title: Mulliken charges with hydrogens summed into heavy atoms:
elementType: O O O N N C C C C C C C C C C C C C C C C C
charge: -0.213784 -0.248366 -0.267313 -0.239143 -0.058037 0.137089 0.040453 0.230662 -0.048686 0.024069 -0.021387 0.323867 -0.106229 0.116530 0.328408 -0.013463 0.176501 -0.176793 -0.300093 -0.159084 0.325205 0.149594
polarizability: 2.77684868e+02 -6.44556603e-01 1.79120995e+02 -2.20204936e+00 4.73638903e+00 1.47898062e+02
1716.lowfreq: -10.9264 -6.5914 -0.0007 -0.0002 0.0005 6.8460 34.8791 51.9310 68.1731
frequency: 34.8590 51.8550 68.1492 86.3850 104.7246 138.8491 162.0758 173.4482 187.7222 198.1543 216.6115 220.8753 224.8163 251.0574 260.9392 277.4232 292.9735 327.2750 343.2974 377.5956 389.6801 403.3584 441.1837 453.0908 467.9053 521.1166 542.8743 566.0972 582.6494 594.9872 606.6116 618.3422 639.2760 654.3250 695.3732 703.0874 712.1935 721.9274 738.9881 781.9613 808.0568 812.9044 836.1357 868.4595 876.0987 897.2495 908.2184 926.6146 936.8789 967.1933 974.9709 1001.6608 1014.0945 1033.2635 1042.4094 1047.6893 1095.1502 1105.2374 1113.2628 1124.0986 1133.9816 1140.5720 1144.8615 1167.1672 1177.4826 1187.6032 1193.6011 1210.7216 1221.9744 1242.8201 1245.7871 1265.6044 1274.3076 1295.5011 1306.9575 1310.0566 1316.2590 1320.7997 1327.4760 1337.7256 1343.6315 1356.7321 1381.8507 1383.6675 1393.9894 1426.5709 1438.2151 1456.0715 1460.1293 1465.3981 1467.0251 1468.9412 1473.7225 1475.6148 1482.8340 1496.4703 1580.0965 1625.6966 1674.4309 1700.0793 2956.7351 2958.2218 2963.7473 2990.2351 2992.2081 2996.2921 3001.0927 3011.1711 3033.3526 3045.1328 3047.7164 3065.0939 3066.4722 3097.8530 3104.6290 3111.1099 3124.3442 3142.3310 3162.3668 3586.4648
redmass: 4.7352 5.6286 4.8667 3.6130 3.8452 4.0854 3.9896 5.7159 3.3249 3.2236 1.5979 1.6527 2.0107 2.0670 2.1087 3.6961 3.1372 2.6826 3.7847 3.8375 4.0298 3.5107 3.1522 4.8932 4.4495 3.9521 4.4239 2.9998 5.2764 3.4495 4.5013 4.1568 1.2479 3.1904 7.5845 5.1513 3.4197 3.8504 6.1528 2.6698 1.9601 1.6283 2.6459 1.9101 2.8574 1.7528 2.0690 2.6536 1.3714 1.9896 2.1056 4.0109 2.0794 2.6913 2.0849 2.0156 2.4128 2.3582 1.2617 1.9031 2.9950 2.1155 1.5242 1.8207 1.4915 2.4504 1.7778 1.6487 1.5299 1.9300 2.0406 1.9605 3.5292 1.4470 1.7061 1.4507 2.0161 1.4049 1.4566 1.5210 1.5148 2.0294 5.6857 1.2109 1.5652 2.8777 1.3112 1.1153 1.0769 1.0897 1.0500 1.0809 1.0751 1.0570 1.0736 2.5621 7.2437 6.8553 7.9154 12.2797 1.0814 1.0342 1.0656 1.0630 1.0612 1.0403 1.0627 1.0802 1.0929 1.1039 1.0994 1.1016 1.1026 1.1004 1.0999 1.0890 1.0993 1.0915 1.0934 1.0802
irintensity: 0.2380 0.1976 0.9430 5.9016 1.5404 1.3320 2.8457 4.9824 1.7524 0.3192 0.8669 0.8887 0.5806 1.5144 0.7083 7.9794 3.3488 2.6060 3.3613 6.0516 2.8622 0.7617 4.4216 9.1784 4.0763 0.9036 31.6253 1.8521 0.0702 1.7489 12.8913 5.0892 96.0007 3.4724 1.6517 11.4475 5.3320 6.5447 31.4990 9.1600 8.0997 25.8356 1.0070 14.2202 13.4612 21.1047 9.5929 8.9049 0.1678 2.4377 21.8589 59.4085 11.0029 24.2321 1.5151 3.5340 10.1659 18.4720 0.5499 29.4575 12.1608 41.9044 5.3231 3.2441 44.4598 20.0307 16.8569 16.0563 1.0848 77.4462 7.3683 84.4571 57.1814 4.0438 28.1542 8.7875 184.4950 0.3596 27.4532 20.0388 21.9015 91.7938 19.6920 26.7636 26.5680 23.2442 1.2941 9.8579 3.3040 11.5863 13.0707 8.3800 47.0138 8.7364 12.2742 108.0938 17.8373 86.2210 601.7522 236.1022 18.5686 73.6323 21.5073 15.3699 28.7147 4.9610 18.9552 19.9665 30.2397 49.6123 33.3237 11.9041 39.2146 12.3487 24.4175 20.4879 24.2482 5.4778 14.5994 73.0758
temp: 298.150 k
press: 1.00000 atm
elementType: 8 8 8 7 7 6 6 6 6 6 6 6 6 6 6 6 6 6 6 6 6 6 1 1 1 1 1 1 1 1 1 1 1 1 1 1 1 1 1 1 1 1
symmnumber: 1
zpe: 903496.1 jmol-1
zpe.correction: 0.344124 hartree
zpe.thermalcorrener: 0.363297 hartree
zpe.thermalcorrenthalpy: 0.364241 hartree
zpe.thermalcorrgfe: 0.297521 hartree
zpe.sumelectzpe: -993.410221 hartree
zpe.sumelectthermal: -993.391048 hartree
zpe.sumelectthermalent: -993.390104 hartree
zpe.sumelectthermalfe: -993.456824 hartree
dipole: -3.7201 -2.1491 0.9554
dipole: 4.4012
quadrupole: -131.7411 -134.1597 -129.3730
quadrupole: 12.3435 6.5085 9.5734
quadrupole: 0.0168 -2.4018 2.3850 12.3435 6.5085 9.5734
hfenergy: -993.7543447 hartree
pointgroup: C01 [X(C17H20N2O3)]
dipole: -1.4678678 -0.8462423 0.3571749 debye
polarizability: 277.7173132|-0.7193325|179.0926252|-0.7694728|4.8230882|147.8939863 unknown
InChI: InChI=1S/C17H20N2O3/c1-17-8-7-13-12-5-4-11(22-2)9-10(12)3-6-14(13)19(17)16(21)18-15(17)20/h4-5,9,13-14,18H,3,6-8H2,1-2H3
charge 0 multiplicity 1
42 atoms
O  5.150811 -1.531549 0.172029
O  2.925233 2.198645 -1.662962
O  -5.713158 0.206793 0.176841
N  2.235864 0.551989 -0.079795
N  4.344147 0.441625 -0.874021
C  0.78805 0.846767 -0.092911
C  -0.008704 -0.430142 -0.494802
C  2.822029 -0.669408 0.54343
C  0.49011 -1.676871 0.298731
C  2.003684 -1.91459 0.093302
C  0.265786 1.451157 1.231406
C  -1.518181 -0.231377 -0.335348
C  -1.189509 1.922101 1.034028
C  4.25433 -0.684475 -0.056513
C  -2.076838 0.845698 0.415143
C  2.953154 -0.584268 2.085562
C  3.121164 1.189672 -0.940247
C  -2.399263 -1.161174 -0.93703
C  -3.478143 0.942449 0.556203
C  -3.800725 -1.066926 -0.80677
C  -4.341468 -0.002546 -0.043411
C  -6.645319 -0.749103 -0.42409
H  0.657205 1.614573 -0.880687
H  0.209101 -0.628392 -1.566019
H  -0.07006 -2.567307 -0.041353
H  0.250749 -1.558619 1.373228
H  2.352087 -2.79799 0.657416
H  2.200564 -2.110297 -0.979202
H  0.907418 2.302577 1.521995
H  0.309217 0.707167 2.048218
H  -1.191197 2.812784 0.371426
H  -1.618382 2.254932 1.997688
H  3.639515 -1.37897 2.426436
H  3.36748 0.392467 2.389399
H  1.980684 -0.721984 2.586119
H  5.171569 0.715228 -1.404615
H  -1.980531 -1.982781 -1.532635
H  -3.925693 1.759782 1.132497
H  -4.443854 -1.806597 -1.292465
H  -6.569259 -0.747181 -1.529083
H  -7.64484 -0.404094 -0.121361
H  -6.473226 -1.774664 -0.042578
