program: Gaussian 09
title: 000290328
version: EM64L-G09RevD.01
frameworkgroup: C1[X(C6H9BrN2O2)]
method: RPBEPBE
basis: SDD
operation: Freq
keyword: #p
keyword: freq=noraman
keyword: PBEPBE/SDD
title: #p freq=noraman PBEPBE/SDD
converged: NO YES NO NO
title: Mulliken charges:
elementType: Br O O N N C C C C C C H H H H H H H H H
charge: -0.000587 -0.207618 -0.226856 -0.422397 -0.397093 0.218483 -0.322314 0.155550 -0.711476 0.170365 -0.727406 0.263272 0.244588 0.327014 0.217775 0.252005 0.241083 0.355984 0.277880 0.291747
chargesum: 0.00000
title: Mulliken charges with hydrogens summed into heavy atoms:
elementType: Br O O N N C C C C C C
charge: -0.000587 -0.207618 -0.226856 -0.095382 -0.041109 0.218483 0.185546 0.155550 -0.000612 0.170365 -0.157779
polarizability: 1.25839688e+02 9.45746255e+00 9.14907826e+01 1.06425066e-01 -2.74863526e+00 7.44893991e+01
1716.lowfreq: -11.1082 -10.2280 -5.3244 0.0004 0.0006 0.0007 40.0382 68.9255 87.4205
frequency: 40.0248 68.9017 87.4181 110.6925 156.3478 180.6331 207.5498 233.4692 279.5296 310.7806 383.9181 445.2722 457.5511 563.6387 603.5243 606.3553 649.8032 653.2145 698.5898 736.8606 752.5011 769.6297 902.1167 943.3742 945.6486 977.2408 1051.9047 1070.5003 1112.7174 1164.9894 1194.2911 1216.8474 1243.3394 1296.6849 1303.3887 1313.8888 1334.1686 1362.4545 1389.7096 1448.5939 1462.7429 1469.3864 1478.8061 1682.1653 1723.6974 2994.9035 3015.1541 3049.9919 3078.6118 3093.0510 3105.6545 3137.2302 3588.9069 3605.2993
redmass: 8.3643 2.2797 6.4441 3.6295 7.0988 4.7741 1.5394 2.0551 4.1567 2.6674 7.2508 3.4753 1.2140 5.1617 4.4474 9.2249 1.2512 3.8008 8.7749 6.2548 2.2829 1.4649 2.2805 2.2678 1.6609 2.2392 2.8433 1.6195 2.7750 2.8899 1.9960 1.6985 1.7255 1.3434 2.3090 2.1570 1.6248 1.6536 1.2228 1.1053 1.0868 1.0581 1.0561 8.4358 9.5679 1.0354 1.0601 1.0567 1.1035 1.1002 1.1008 1.1105 1.0803 1.0799
irintensity: 1.0993 0.6192 1.1263 2.5304 0.7941 1.1191 1.8128 2.9138 12.1445 0.2384 12.8795 2.0546 133.5490 16.4971 1.0917 17.8851 148.9398 4.7237 3.1661 55.1695 12.2834 24.4029 10.1314 3.1420 5.6739 22.1507 3.4119 4.6524 12.8905 20.2879 1.9282 50.5308 110.2061 25.4672 136.4882 32.3614 69.8690 11.0685 17.3747 2.7323 5.7847 7.6241 15.2960 547.0008 395.1090 13.8761 2.7105 19.0568 4.2259 22.5455 13.7098 11.1521 77.8138 36.1170
temp: 298.150 k
press: 1.00000 atm
elementType: 35 8 8 7 7 6 6 6 6 6 6 1 1 1 1 1 1 1 1 1
symmnumber: 1
zpe: 399275.6 jmol-1
zpe.correction: 0.152076 hartree
zpe.thermalcorrener: 0.163596 hartree
zpe.thermalcorrenthalpy: 0.164540 hartree
zpe.thermalcorrgfe: 0.112666 hartree
zpe.sumelectzpe: -506.647021 hartree
zpe.sumelectthermal: -506.635502 hartree
zpe.sumelectthermalent: -506.634557 hartree
zpe.sumelectthermalfe: -506.686432 hartree
dipole: 0.2763 0.1950 2.7329
dipole: 2.7538
quadrupole: -87.5241 -87.9227 -69.1788
quadrupole: -6.1425 0.8085 1.2128
quadrupole: -5.9823 -6.3808 12.3631 -6.1425 0.8085 1.2128
hfenergy: -506.7990974 hartree
pointgroup: C01 [X(C6H9Br1N2O2)]
dipole: -0.2455569 -0.0370546 -1.0545653 debye
dipolederiv: -0.5340922 -0.0920082 0.1078814 -0.06951 -0.1416724 0.0076828 0.2109272 0.041061 -0.1978732 -0.4994611 0.0503573 -0.0414701 0.057813 -1.0901697 -0.168818 -0.0637765 -0.2237554 -0.4146005 -0.974804 0.4011001 -0.1110735 0.5670405 -0.9419326 0.0220398 -0.1085324 -0.0127763 -0.3972925 -1.1517282 0.0897443 -0.1606461 0.1080938 -0.4677579 0.1058399 -0.1681243 0.1123583 -0.5935294 -0.7165723 0.4655397 0.0115535 0.2585183 -1.2751153 -0.1915431 -0.1219799 -0.0889577 -0.3957456 0.1094806 -0.2564209 -0.1684812 -0.5549013 0.2761448 -0.1912523 -0.3761549 -0.1679017 0.2440871 -0.0858089 0.0077654 0.0326778 0.024772 0.0003034 -0.0122121 0.1008573 -0.0142394 -0.060459 1.0053937 -0.520172 0.1903819 -0.1752275 1.424026 0.2570615 0.4355959 0.1735082 0.3267405 -0.0150321 0.0368891 0.0156623 0.0644979 -0.0176348 0.006546 0.0504225 0.0777159 -0.0302606 1.6408757 -0.3977087 0.4176336 -0.5854671 1.6680275 0.2395832 0.4740681 0.2852758 0.5545943 0.6855367 0.063843 -0.2515128 0.1260365 0.1381482 -0.0354037 -0.2542538 -0.0457058 0.2468301 0.0382588 0.0320791 -0.0010363 0.039607 -0.0448236 -0.0167426 -0.0095001 -0.0208955 0.0935426 0.051244 0.0067024 -0.0293766 -0.011138 0.0514546 0.0688119 -0.0579363 0.0496352 -0.0649146 0.2360571 0.0276764 -0.0925251 0.0455707 0.1831964 -0.0384463 -0.1050338 -0.05509 0.3008666 0.0101877 -0.0767974 -0.1058761 -0.0875443 0.0055352 -0.0636037 -0.1048064 -0.0396646 0.021093 0.0650065 0.0768825 -0.0112184 0.1003814 -0.0385205 0.0078432 -0.010732 -0.0395694 0.0749309 -0.0805755 -0.0249726 0.1158182 -0.0111516 0.094998 0.0148365 0.0765808 0.0192816 0.0298108 0.2538909 0.0313084 -0.0503273 0.0727611 0.1778041 -0.0356143 -0.0392368 -0.0499083 0.3315858 -0.0306321 0.0837708 0.0872639 0.0216146 -0.0644571 -0.0414956 0.0704708 -0.0461165 0.034725 -0.0072253 -0.0055787 0.044671 0.0082331 0.0624455 0.0648868 0.0011449 0.0457445 -0.1041314 unknown
polarizability: 126.6536311|-5.7662991|90.3708671|-6.0200582|1.9383832|74.7953712 unknown
InChI: InChI=1S/C6H9BrN2O2/c1-6(2-3-7)4(10)8-5(11)9-6/h8-9H,2-3H2,1H3
charge 0 multiplicity 1
20 atoms
Br -4.19718 -0.663206 0.914779
O  0.756572 2.347558 0.683642
O  2.646317 -1.944969 0.165211
N  0.56576 -1.007097 -0.527164
N  1.973803 0.308142 0.61944
C  -0.136833 0.294323 -0.454947
C  -1.453056 0.226626 0.388785
C  0.893073 1.148003 0.349973
C  -0.348901 0.928089 -1.852362
C  1.814521 -1.01286 0.083331
C  -2.555763 -0.599723 -0.277923
H  -1.79841 1.262542 0.556749
H  -1.216446 -0.208253 1.376907
H  0.241952 -1.813709 -1.057247
H  -1.024069 0.313768 -2.47352
H  -0.786119 1.934982 -1.742052
H  0.61284 1.023085 -2.384558
H  2.809019 0.583023 1.136925
H  -2.278396 -1.656615 -0.416815
H  -2.920683 -0.166507 -1.22045
