program: Gaussian 09
title: 000003683
version: EM64L-G09RevD.01
frameworkgroup: C1[X(C23H26Cl2N2O4)]
method: RPBEPBE
basis: SDD
operation: Freq
keyword: #p
keyword: freq=noraman
keyword: PBEPBE/SDD
title: #p freq=noraman PBEPBE/SDD
converged: YES YES NO NO
title: Mulliken charges:
elementType: Cl Cl O O O O N N C C C C C C C C C C C C C C C C C C C C C C C H H H H H H H H H H H H H H H H H H H H H H H H H H
charge: -0.029315 -0.017774 -0.292366 -0.250965 -0.424968 -0.187993 -0.093184 -0.119089 -0.380707 -0.373406 -0.458149 -0.438034 -0.414185 -0.233913 0.458813 0.298442 -0.673482 -0.519546 -0.443925 -0.709583 0.353935 -0.233876 -0.373562 0.553609 -0.444387 -0.345638 -0.337333 -0.053730 -0.217466 -0.114659 0.160384 0.279207 0.180736 0.220873 0.177416 0.208315 0.235158 0.226259 0.207535 0.210572 0.197552 0.301521 0.251354 0.249380 0.245640 0.279115 0.249967 0.249225 0.251260 0.224267 0.248997 0.257169 0.262310 0.245238 0.249459 0.256739 0.390788
chargesum: 0.00000
title: Mulliken charges with hydrogens summed into heavy atoms:
elementType: Cl Cl O O O O N N C C C C C C C C C C C C C C C C C C C C C C C
charge: -0.029315 -0.017774 -0.292366 -0.250965 -0.034180 -0.187993 -0.093184 -0.119089 0.079235 0.024883 -0.014676 -0.004240 -0.006061 0.067607 0.458813 0.298442 0.072892 -0.240431 -0.193959 -0.209097 0.353935 -0.009608 -0.124565 0.553609 -0.187219 -0.083328 0.157364 -0.053730 0.039273 -0.114659 0.160384
polarizability: 4.00817566e+02 2.86142288e+00 2.97864501e+02 1.18855502e+01 3.03055826e+01 1.95380491e+02
1716.lowfreq: -1.6881 -0.0013 0.0010 0.0011 1.4562 3.9169 7.8330 11.0645 15.3377
frequency: 7.7287 10.8480 15.3140 24.5027 29.1855 33.9995 40.2161 44.4283 47.1373 56.4124 62.6796 88.0051 106.6428 108.1489 125.5653 129.6115 152.4863 165.9091 170.1235 177.5280 185.0282 198.4053 209.2571 222.2060 228.6438 235.5604 253.9081 261.1005 296.7499 321.1707 343.9030 358.1333 361.9921 362.7381 428.4359 432.4247 439.7702 447.9805 481.7801 507.7969 513.6358 522.8293 526.7884 532.3068 552.3163 584.3592 598.3242 620.2857 626.3833 628.0667 636.0928 651.9382 660.9631 683.7131 695.0760 713.8750 750.0182 769.3319 782.9657 797.8866 821.4570 846.7001 850.5053 861.1803 879.0917 879.3884 879.7209 890.1178 899.9936 905.2821 941.8494 946.1007 955.3996 966.7075 969.5341 971.9665 984.1857 1003.0016 1006.1513 1008.6421 1018.8383 1056.5662 1064.4935 1074.6488 1094.4070 1097.8391 1102.9417 1105.1225 1120.5287 1130.0148 1146.9828 1152.5800 1162.5650 1181.6037 1185.8865 1190.2567 1197.6205 1204.2489 1205.0365 1215.8231 1228.7301 1240.1741 1247.5340 1258.0266 1261.0463 1269.3903 1275.0349 1291.5351 1291.8768 1296.4874 1308.8935 1322.4172 1329.8889 1356.7241 1372.3664 1373.0635 1375.7428 1383.9840 1390.6749 1397.2426 1435.4749 1437.7157 1451.1105 1455.7109 1463.9523 1464.4935 1466.9557 1477.8565 1480.0989 1484.2954 1489.0630 1491.9088 1503.0822 1572.6397 1579.8006 1586.1997 1600.7144 1621.2828 1706.5411 2831.9106 2837.5337 2851.8290 2959.5268 2967.1376 2968.8159 2996.1975 3011.1979 3015.2661 3017.8407 3022.1366 3032.4645 3047.0445 3060.9556 3063.9375 3068.5077 3092.6713 3099.1302 3133.8332 3151.2268 3157.7882 3159.0886 3160.8802 3170.3690 3182.2706 3527.8173
redmass: 8.1211 6.2211 8.9993 9.7882 7.3291 2.2979 5.8683 4.7916 5.5791 3.2844 5.8382 5.3618 2.7558 3.6872 3.4067 3.6869 3.5039 4.9087 1.7744 5.3757 6.8262 5.0715 3.0489 4.1396 4.7982 4.4919 3.2016 5.4565 2.5681 5.6358 3.2921 2.5074 5.0485 5.4484 4.0855 6.1706 3.1362 3.6239 5.2238 2.8024 2.1516 4.3733 4.0377 5.0150 4.8959 4.2553 4.1169 5.3401 3.2324 1.8384 3.0344 5.0662 5.3741 4.2549 2.6913 2.8341 1.8280 1.9473 2.2393 2.2460 1.7930 3.3206 1.7853 2.2904 2.1074 1.6585 2.2887 2.9928 2.7065 1.5863 2.2194 2.1946 1.6264 1.9437 1.4880 1.5846 5.8250 5.2615 1.8936 2.0742 3.3481 2.8312 2.6571 2.4572 2.0036 1.6586 1.7728 1.3698 2.0958 2.8545 1.5067 2.0210 2.1291 1.1413 1.4690 1.1742 1.3666 2.0803 1.0777 1.7123 1.3146 1.5628 2.5088 1.4897 1.9894 1.6349 1.7352 1.2656 1.3504 1.3069 1.3357 1.7713 1.4343 1.4174 2.0192 7.8071 1.4791 2.1605 2.2188 3.7142 1.2501 1.9914 1.1976 1.2928 1.3875 1.7139 1.1189 1.9837 1.1666 1.0891 1.0913 1.0566 1.1013 7.3830 7.6403 6.0133 6.8782 6.6863 9.3315 1.0708 1.0714 1.0700 1.0557 1.0563 1.0489 1.0847 1.0614 1.1033 1.0841 1.0729 1.0757 1.0938 1.0936 1.0946 1.1022 1.1054 1.0999 1.0866 1.0922 1.0915 1.0916 1.0890 1.0977 1.0971 1.0643
irintensity: 0.0646 0.3585 0.0388 1.3095 0.1489 0.2228 1.5472 0.8059 0.7706 3.3877 2.9323 0.6180 6.0345 1.3540 4.9245 1.5324 0.9711 1.6922 1.1893 0.5579 0.6721 0.1296 0.1945 2.6620 0.9958 1.3550 0.6807 7.4151 2.6524 3.9546 2.4418 11.0672 10.3199 3.6860 8.0612 12.7140 6.4826 18.1049 4.4298 10.2581 48.5792 8.9942 25.6434 10.5704 10.8781 13.2561 8.3035 12.4184 35.7592 94.0754 0.6475 11.4750 5.2037 9.7400 15.6690 17.0906 8.5432 14.7474 48.7085 17.5177 17.0571 23.8482 4.2790 22.1070 1.5317 13.0558 0.3254 7.2048 6.2828 18.5388 6.5269 24.2073 7.8822 25.2378 5.3248 0.2054 4.4774 37.6908 9.5656 10.9166 436.4383 49.1517 17.4315 26.9383 92.5755 12.1953 9.5336 2.4570 38.9999 44.6681 0.8185 10.7752 87.6752 1.0670 3.7246 0.9900 16.6427 1.3211 0.4850 4.7458 8.5322 0.5076 203.9526 6.0680 8.5391 30.4733 25.6076 7.4597 7.0151 3.8670 28.7452 106.1223 4.3306 6.1080 18.7635 0.6168 4.8610 41.0622 35.7841 1.5910 8.1301 80.9571 57.4924 7.1453 39.5797 43.1499 0.5074 62.9425 12.3177 5.1827 21.6550 11.5925 5.3764 15.2230 187.9874 78.2857 10.6258 108.3460 202.2290 57.1953 52.4258 234.3204 51.3621 33.6841 18.4321 44.8123 18.4530 16.3400 21.9890 63.1732 54.0983 9.5961 4.2540 16.8272 2.0371 68.1581 18.1482 9.4038 2.6848 6.6547 17.6497 2.1808 13.2205 2.6208 38.2755
temp: 298.150 k
press: 1.00000 atm
elementType: 17 17 8 8 8 8 7 7 6 6 6 6 6 6 6 6 6 6 6 6 6 6 6 6 6 6 6 6 6 6 6 1 1 1 1 1 1 1 1 1 1 1 1 1 1 1 1 1 1 1 1 1 1 1 1 1 1
symmnumber: 1
zpe: 1177261.2 jmol-1
zpe.correction: 0.448395 hartree
zpe.thermalcorrener: 0.479448 hartree
zpe.thermalcorrenthalpy: 0.480392 hartree
zpe.thermalcorrgfe: 0.378713 hartree
zpe.sumelectzpe: -2220.250106 hartree
zpe.sumelectthermal: -2220.219053 hartree
zpe.sumelectthermalent: -2220.218109 hartree
zpe.sumelectthermalfe: -2220.319788 hartree
dipole: 7.4158 3.7872 2.8745
dipole: 8.8091
quadrupole: -189.7682 -183.2851 -193.5167
quadrupole: -14.4087 1.4112 1.5657
quadrupole: -0.9116 5.5715 -4.6600 -14.4087 1.4112 1.5657
hfenergy: -2220.6985012 hartree
pointgroup: C01 [X(C23H26Cl2N2O4)]
dipole: 2.8375702 1.6077372 1.1725244 debye
polarizability: 400.1950922|7.3534498|297.3506538|11.6943126|32.5057096|196.5168121 unknown
InChI: InChI=1S/C23H26Cl2N2O4/c1-26(22(28)12-16-7-8-19(24)20(25)11-16)21(14-27-9-2-3-10-27)17-5-4-6-18(13-17)31-15-23(29)30/h4-8,11,13,21,29H,2-3,9-10,12,14-15H2,1H3
charge 0 multiplicity 1
57 atoms
Cl -7.031224 -1.327918 1.202205
Cl -6.658391 -3.62161 -1.141213
O  -0.990491 -0.189315 -0.993916
O  4.548881 -1.379539 -0.047249
O  7.484103 -3.50949 -0.074038
O  5.222244 -4.072317 -0.148638
N  -1.113669 3.396249 -0.099029
N  0.052415 0.883239 0.789554
C  -1.705654 3.102213 -1.436361
C  -1.603987 4.760042 0.237385
C  -3.156521 3.63481 -1.314236
C  -3.091304 4.733712 -0.197854
C  0.345261 3.24532 -0.00494
C  0.799192 1.768222 -0.148617
C  2.314214 1.561915 -0.000446
C  -0.88156 0.003289 0.260633
C  0.170313 1.179875 2.22585
C  2.809556 0.240036 -0.070762
C  3.234485 2.629376 0.178441
C  -1.758639 -0.756622 1.281781
C  4.193502 -0.017577 0.036226
C  4.616544 2.363399 0.281883
C  5.115591 1.043901 0.213089
C  -2.958945 -1.45149 0.66434
C  -4.260903 -1.133205 1.117216
C  -2.811419 -2.433289 -0.348376
C  5.962257 -1.697505 0.02441
C  -5.389532 -1.783529 0.576108
C  -3.938323 -3.084856 -0.887584
C  -5.231954 -2.761571 -0.425079
C  6.110666 -3.209096 -0.078094
H  -1.660609 2.024761 -1.663523
H  -1.154816 3.653698 -2.242144
H  -1.46719 4.970549 1.313935
H  -1.050026 5.546485 -0.338434
H  -3.517167 4.035875 -2.277226
H  -3.83876 2.821281 -1.01488
H  -3.737431 4.455044 0.652118
H  -3.420781 5.723258 -0.559579
H  0.670316 3.649516 0.974033
H  0.875755 3.839611 -0.795119
H  0.503566 1.406736 -1.152209
H  1.179055 1.580652 2.423988
H  -0.58124 1.92772 2.547167
H  0.057282 0.267296 2.832326
H  2.128274 -0.604814 -0.21391
H  2.886839 3.664826 0.231587
H  -2.098891 -0.058231 2.066826
H  -1.110526 -1.502366 1.788206
H  5.319964 3.192448 0.417934
H  6.191986 0.866385 0.295033
H  -4.410341 -0.374434 1.892231
H  -1.816632 -2.672166 -0.732817
H  6.412377 -1.365997 0.983321
H  6.533999 -1.227678 -0.801829
H  -3.824726 -3.84037 -1.670376
H  7.609419 -4.494856 -0.133147
