program: Gaussian 09
title: 000290311
version: EM64L-G09RevD.01
frameworkgroup: C1[X(C9H15ClO2)]
method: RPBEPBE
basis: SDD
operation: Freq
keyword: #p
keyword: freq=noraman
keyword: PBEPBE/SDD
title: #p freq=noraman PBEPBE/SDD
converged: YES YES NO NO
title: Mulliken charges:
elementType: Cl O O C C C C C C C C C H H H H H H H H H H H H H H H
charge: -0.091286 -0.280243 -0.433115 -0.097987 -0.245722 -0.594384 -0.348370 -0.447025 -0.301845 -0.684645 0.041381 -0.084565 0.249856 0.222066 0.194970 0.285417 0.301406 0.211968 0.215647 0.231468 0.227701 0.221041 0.219858 0.211097 0.225197 0.210048 0.340067
chargesum: 0.00000
title: Mulliken charges with hydrogens summed into heavy atoms:
elementType: Cl O O C C C C C C C C C
charge: -0.091286 -0.280243 -0.093048 0.151868 0.171314 -0.007561 0.079245 0.012144 0.139054 -0.038304 0.041381 -0.084565
polarizability: 1.60211138e+02 9.62995298e+00 9.60783886e+01 1.15582923e+01 -1.66970702e+00 9.16350205e+01
1716.lowfreq: -37.3575 -8.3023 -1.7400 -0.0013 -0.0008 0.0009 5.2482 18.6541 38.9422
frequency: -35.3079 18.3480 38.7031 44.5639 83.9486 96.8042 100.7707 160.1378 167.7547 207.2851 231.8793 248.8693 264.5590 300.1642 338.4889 384.0587 412.7172 424.0091 470.9615 511.1276 545.4514 665.9599 733.0612 788.7106 833.6644 856.8709 883.4752 893.2613 915.4590 979.1366 997.6022 1020.4800 1048.6387 1050.2367 1093.7989 1094.8005 1101.6562 1164.4772 1176.5962 1196.9731 1203.9383 1224.7173 1227.1054 1274.8175 1282.1047 1283.4094 1313.6482 1337.8190 1341.0067 1367.7707 1392.3070 1397.4508 1424.9826 1452.4492 1462.0822 1473.0452 1477.4366 1479.9256 1484.4622 2285.9474 2916.0574 2940.9766 2956.8623 2964.8908 2974.9191 2996.5729 3002.6529 3009.0791 3036.5197 3046.7023 3074.8357 3076.1543 3078.2592 3167.5737 3498.2802
redmass: 2.0407 6.4253 3.5553 4.6783 2.9535 3.4961 4.2335 3.6179 3.9297 4.4768 1.1261 3.5617 3.1343 3.2703 3.3048 4.8614 2.3525 1.2753 5.0756 4.1862 5.9834 3.8311 1.1101 3.4290 2.8706 1.2383 2.0612 2.1629 4.8263 1.7315 1.8814 9.3808 2.8929 1.5877 1.4482 2.0451 1.6577 1.1660 2.7207 1.0815 1.5282 1.3130 1.3128 1.4049 1.0824 1.2611 1.2630 1.4188 1.3870 1.2590 1.2138 1.4817 1.1136 1.0819 1.0889 1.0577 1.0734 1.0431 1.0727 11.7543 1.0542 1.0565 1.1046 1.0584 1.0359 1.0603 1.1031 1.0992 1.0856 1.1017 1.0571 1.1022 1.0991 1.1123 1.0653
irintensity: 0.0361 0.0233 0.2318 0.1102 0.8259 12.4929 0.8594 11.9055 5.5676 7.3142 0.2030 5.1960 2.2838 0.3202 0.5674 0.9796 6.2706 145.1002 2.2171 28.1665 5.5855 16.5105 8.7565 5.9981 19.7479 0.5925 5.2702 2.3410 33.4477 17.0058 25.2995 232.3379 4.2084 6.9014 1.0065 17.6994 54.6971 3.7273 6.6831 4.3541 30.8399 0.0865 5.0871 4.2416 0.1366 15.2833 42.6159 1.9562 12.7308 51.2797 12.1778 13.5547 22.7266 3.4855 2.9434 3.7680 9.8903 13.4850 14.6677 32.4656 44.0268 60.8671 38.0720 18.3273 39.6625 30.0427 34.7761 6.0715 14.3709 1.8580 12.9856 81.3673 46.3750 3.5694 14.4208
temp: 298.150 k
press: 1.00000 atm
elementType: 17 8 8 6 6 6 6 6 6 6 6 6 1 1 1 1 1 1 1 1 1 1 1 1 1 1 1
symmnumber: 1
zpe: 583013.4 jmol-1
zpe.correction: 0.222058 hartree
zpe.thermalcorrener: 0.236436 hartree
zpe.thermalcorrenthalpy: 0.237381 hartree
zpe.thermalcorrgfe: 0.178045 hartree
zpe.sumelectzpe: -961.413658 hartree
zpe.sumelectthermal: -961.399280 hartree
zpe.sumelectthermalent: -961.398335 hartree
zpe.sumelectthermalfe: -961.457671 hartree
dipole: 2.5615 -0.0391 -0.4960
dipole: 2.6094
quadrupole: -78.1456 -83.6026 -75.9051
quadrupole: 0.0976 1.7658 4.8214
quadrupole: 1.0722 -4.3849 3.3127 0.0976 1.7658 4.8214
hfenergy: -961.6357159 hartree
pointgroup: C01 [X(C9H15Cl1O2)]
dipole: -1.0125577 0.151422 -0.0756077 debye
polarizability: 160.0151773|13.4773504|92.248108|-7.7160964|1.7141883|95.6612617 unknown
InChI: InChI=1S/C9H15ClO2/c1-2-3-4-5-6-12-8-9(11)7-10/h9,11H,2-3,6-8H2,1H3
charge 0 multiplicity 1
27 atoms
Cl 4.125536 -1.215919 -1.613207
O  1.008308 0.370846 0.168514
O  4.635745 0.566549 0.939748
C  3.299428 -0.017121 0.801206
C  2.343712 0.982286 0.126254
C  3.325627 -1.382603 0.111996
C  -4.708159 0.040884 0.68741
C  -3.76179 -0.57375 -0.382901
C  -0.000523 1.226867 -0.495153
C  -6.0841 -0.656393 0.702598
C  -2.430616 0.056022 -0.428827
C  -1.312493 0.578195 -0.450747
H  2.950591 -0.186474 1.837105
H  2.365978 1.938548 0.689271
H  2.657248 1.172618 -0.924157
H  3.965175 -2.101916 0.642258
H  2.311431 -1.765637 -0.06578
H  -4.830014 1.121207 0.48171
H  -4.227283 -0.040812 1.680333
H  -3.639698 -1.657263 -0.180063
H  -4.242297 -0.499217 -1.379742
H  0.307379 1.40519 -1.549843
H  -0.041103 2.212957 0.019441
H  -5.982775 -1.734439 0.930023
H  -6.747866 -0.212062 1.465906
H  -6.589303 -0.565243 -0.277626
H  5.089161 0.493782 0.057073
