program: Gaussian 09
title: 000290304
version: EM64L-G09RevD.01
frameworkgroup: C1[X(C7H10O2)]
method: RPBEPBE
basis: SDD
operation: Freq
keyword: #pfreq=noraman
keyword: PBEPBE/SDD
title: #p freq=noraman PBEPBE/SDD
converged: YES YES NO NO
title: Mulliken charges:
elementType: O O C C C C C C C H H H H H H H H H H
charge: -0.303921 -0.273794 -0.037149 -0.350431 -0.287245 -0.068816 -0.693543 0.213225 -0.493743 0.247541 0.224324 0.218300 0.197149 0.226729 0.212304 0.217025 0.238326 0.232740 0.280980
chargesum: 0.00000
title: Mulliken charges with hydrogens summed into heavy atoms:
elementType: O O C C C C C C C
charge: -0.303921 -0.273794 0.210392 0.092192 0.136632 0.143488 -0.005452 0.213225 -0.212762
polarizability: 9.39119853e+01 1.16043340e+01 8.53888784e+01 -3.46973015e+00 -4.31423961e+00 5.69520955e+01
1716.lowfreq: -9.3139 -2.1466 -0.0002 0.0005 0.0008 10.3272 37.0014 47.0590 111.2384
frequency: 36.7993 46.9106 111.2227 114.6705 178.1071 199.7269 239.6424 282.1565 306.3133 411.7722 437.9761 535.2097 566.4064 634.6467 669.6414 739.8520 789.5488 796.9748 855.0422 891.2429 965.2641 997.7110 1026.0662 1035.8913 1090.6262 1097.4756 1110.3936 1123.5230 1146.8140 1202.6065 1238.1387 1284.8914 1309.6312 1355.8522 1387.6273 1414.8246 1459.4007 1474.4205 1474.6834 1485.9256 2129.3189 2928.0655 2950.0467 3004.4842 3010.6078 3068.1948 3108.7529 3113.4648 3115.9553 3176.9292 3423.9865
redmass: 2.9358 4.4037 3.8663 3.8326 3.5276 1.5147 1.8321 3.4202 4.5488 2.2801 4.3797 3.8301 5.9681 1.2254 1.2498 6.5486 3.7855 3.4448 2.9912 1.1816 1.9834 3.3824 1.4072 2.5047 1.8671 1.3886 1.3217 1.8818 1.7957 1.2936 1.4398 1.1733 1.3829 1.3769 1.2150 1.9075 1.0443 1.2054 1.0474 1.1295 6.0116 1.0823 1.0567 1.0347 1.1050 1.0531 1.1006 1.0917 1.1012 1.1189 1.1591
irintensity: 2.5074 0.5219 3.1384 4.0115 7.8551 0.9296 2.4802 16.6299 1.4395 0.4315 4.9502 5.5106 2.9377 73.1203 60.5425 6.9555 20.6286 20.1965 15.9867 3.8821 8.6778 68.2651 2.0163 100.4368 54.5027 7.0871 9.6829 9.7797 9.3858 3.4661 1.9412 15.4659 23.8294 3.1676 17.1040 0.3613 9.0260 4.4062 7.7680 4.3234 0.3313 40.1438 46.9670 15.9870 30.1875 27.2957 23.1222 14.8466 23.4461 32.5683 58.7797
temp: 298.150 k
press: 1.00000 atm
elementType: 8 8 6 6 6 6 6 6 6 1 1 1 1 1 1 1 1 1 1
symmnumber: 1
zpe: 398089.9 jmol-1
zpe.correction: 0.151624 hartree
zpe.thermalcorrener: 0.162054 hartree
zpe.thermalcorrenthalpy: 0.162998 hartree
zpe.thermalcorrgfe: 0.114733 hartree
zpe.sumelectzpe: -422.347086 hartree
zpe.sumelectthermal: -422.336657 hartree
zpe.sumelectthermalent: -422.335712 hartree
zpe.sumelectthermalfe: -422.383978 hartree
dipole: 1.7307 -1.2734 0.4518
dipole: 2.1957
quadrupole: -56.4796 -51.0721 -52.4937
quadrupole: 7.8361 2.1286 -2.6976
quadrupole: -3.1311 2.2764 0.8548 7.8361 2.1286 -2.6976
hfenergy: -422.4987108 hartree
pointgroup: C01 [X(C7H10O2)]
dipole: -0.656007 -0.5229462 -0.2059647 debye
dipolederiv: -0.5358927 -0.1431938 -0.0135217 -0.2120386 -0.5213032 0.0763629 -0.0270248 0.0754428 -0.3614106 -1.162398 -0.0641221 0.0106256 -0.2384748 -0.5278947 -0.0436463 -0.0742318 -0.0324394 -0.3768888 0.3044035 -0.0323114 0.0421915 0.0860706 0.1759143 -0.0230863 0.1108567 0.0254241 0.314396 0.1048084 0.06702 0.085818 -0.056383 0.2468381 0.0290946 0.0711707 -0.0310369 0.2538669 0.6195219 0.0464337 -0.1213073 0.3747737 0.3711716 0.0289402 -0.208807 0.0120972 0.278672 0.9587977 -0.100938 0.0281617 -0.1542931 0.5091959 0.0902797 0.1908872 0.1015518 0.4358053 -0.0910246 0.0092254 0.0273408 -0.0545074 -0.0575218 0.0180358 0.0085288 0.0028416 0.054525 -0.191487 -0.0908967 -0.019298 -0.0387916 -0.0478959 0.014578 -0.0536639 -0.0039851 -0.1215025 -0.3606502 0.0627475 0.0050383 0.1053303 -0.4127793 0.0153137 0.0405122 -0.0150657 -0.295294 0.008232 0.0105311 0.0239726 0.0214766 0.0962677 -0.0303283 0.0026306 -0.0129884 -0.1139741 -0.0062894 0.0797043 -0.0996203 0.0913124 -0.0050924 0.0317344 -0.1031829 0.0623951 0.0012371 0.1144949 -0.0047827 -0.0517245 0.0308451 -0.0190292 -0.0690519 -0.027208 -0.1041548 -0.0725427 -0.0230608 -0.0259976 0.0363424 -0.0478424 0.0303241 -0.0650383 0.0877368 0.0029327 -0.1735295 -0.0139018 0.0700733 0.0099722 -0.0215833 -0.1365388 -0.0021269 0.0218621 -0.0259084 0.063419 -0.0421573 0.0285898 0.0699934 0.0458873 0.0026841 -0.0044259 -0.0341324 -0.033076 -0.1779157 -0.1131218 -0.0300198 -0.0818946 -0.0148745 0.09742 0.0206366 -0.0906109 -0.0006946 0.0567727 0.1125729 -0.0037269 0.0096919 -0.0132865 0.0837929 -0.0344092 0.0396681 0.0191554 -0.1090301 0.0587822 0.1018631 0.0398959 0.0818018 -0.1099537 -0.0392289 0.0429137 -0.0273891 0.0840841 0.2583701 0.0198007 -0.0016778 0.0145773 0.2244003 -0.0136337 0.002095 -0.0151023 0.2593099 unknown
polarizability: 94.9432686|-11.3632637|84.4541269|-2.5214137|4.1620753|56.8555638 unknown
InChI: InChI=1S/C7H10O2/c1-3-6(2)8-4-7-5-9-7/h1,6-7H,4-5H2,2H3
charge 0 multiplicity 1
19 atoms
O  3.192578 0.902113 0.016059
O  -0.228436 -0.651902 0.255274
C  1.973302 0.220333 0.596591
C  3.125905 -0.606194 0.122278
C  0.716817 0.369357 -0.232547
C  -1.556994 -0.579576 -0.396619
C  -2.339635 -1.803388 0.107325
C  -2.249676 0.697369 -0.102309
C  -2.816184 1.765046 0.143691
H  1.84475 0.372247 1.675666
H  3.812874 -1.047176 0.854093
H  3.046174 -1.130188 -0.838595
H  0.9426 0.213568 -1.309259
H  0.28767 1.384306 -0.103862
H  -1.416515 -0.650367 -1.499227
H  -3.341374 -1.83764 -0.353996
H  -2.452974 -1.753492 1.202664
H  -1.788817 -2.723121 -0.151546
H  -3.316364 2.691505 0.361019
