program: Gaussian 09
title: 000290303
version: EM64L-G09RevD.01
frameworkgroup: C1[X(C24H27NO5)]
method: RPBEPBE
basis: SDD
operation: Freq
keyword: #p
keyword: freq=noraman
keyword: PBEPBE/SDD
title: #p freq=noraman PBEPBE/SDD
converged: YES YES NO NO
title: Mulliken charges:
elementType: O O O O O N C C C C C C C C C C C C C C C C C C C C C C C C H H H H H H H H H H H H H H H H H H H H H H H H H H H
charge: -0.275470 -0.285264 -0.287553 -0.244123 -0.233840 -0.353315 -0.565493 0.501303 0.393156 -0.392052 0.438426 -0.623364 -0.432251 -0.433639 -0.583059 -0.569971 0.219250 -0.677999 0.195656 0.245344 0.514202 -0.512956 -0.494069 0.230104 0.179992 -0.328196 -0.545894 -0.521554 -0.538291 -0.550025 0.241580 0.212305 0.223495 0.255348 0.264592 0.232532 0.239762 0.264555 0.317981 0.261762 0.253555 0.213364 0.296585 0.231778 0.233701 0.227958 0.230382 0.242322 0.211857 0.255976 0.229756 0.227701 0.225941 0.243773 0.250535 0.218727 0.223120
chargesum: 0.00000
title: Mulliken charges with hydrogens summed into heavy atoms:
elementType: O O O O O N C C C C C C C C C C C C C C C C C C C C C C C C
charge: -0.275470 -0.285264 -0.287553 -0.244123 -0.233840 -0.035334 -0.111608 0.501303 0.393156 0.086791 0.438426 -0.358772 -0.199719 -0.193877 -0.318504 -0.308208 0.219250 -0.211079 0.195656 0.245344 0.514202 -0.216371 -0.262291 0.230104 0.179992 -0.094496 0.154768 0.176036 0.159125 0.142357
polarizability: 3.24009940e+02 4.45344744e+01 3.68478725e+02 -3.15698589e+01 -6.75887928e+00 1.98555616e+02
1716.lowfreq: -8.5142 -4.2451 -0.0008 -0.0007 -0.0006 2.2151 6.8141 14.8747 20.1064
frequency: 3.4719 14.8226 20.0845 27.9398 35.8707 51.4989 61.2487 73.4312 75.7306 83.8444 95.6244 107.5775 117.4709 139.2026 150.7817 161.1186 172.6160 179.0175 190.0053 193.6515 209.6385 230.8318 242.6812 246.1586 268.3714 274.9095 288.8799 304.2920 317.1100 333.1073 342.4050 358.4676 362.9206 378.7652 412.3083 416.5824 438.4547 451.4596 465.6547 473.9302 477.3792 487.4372 524.5427 536.5985 562.4907 577.8263 587.7258 612.9090 617.4303 639.0523 648.6392 690.5433 715.9133 724.4207 726.9558 736.2016 744.5758 766.5784 772.6171 792.4893 808.2757 814.0187 835.3279 849.5287 882.3785 900.1398 904.6788 905.9177 917.8597 918.5210 928.0436 945.0754 950.5958 966.2389 982.9277 986.0206 989.7058 1000.1225 1034.0718 1076.8652 1108.8965 1109.5671 1109.7325 1111.1512 1114.9791 1129.8077 1139.1863 1149.4071 1150.3103 1157.4464 1158.2921 1163.3050 1171.4740 1179.4156 1186.1922 1193.1002 1216.7879 1238.2983 1240.2210 1258.1012 1265.5827 1276.8139 1278.0825 1281.5466 1302.1854 1315.4999 1317.6638 1359.7839 1397.4833 1404.7289 1409.1905 1413.9466 1420.6890 1426.7582 1433.4585 1443.2204 1443.7665 1446.3614 1455.1416 1456.2887 1462.9475 1465.3772 1466.7456 1469.7318 1469.8435 1471.5832 1472.2365 1480.8463 1484.3745 1492.7745 1507.1410 1510.5511 1572.3964 1588.7273 1606.8398 1609.0319 1611.7369 1638.7299 2949.4885 2958.2730 2964.2287 2973.4244 2993.6007 2995.3446 3011.4023 3033.7888 3047.0431 3053.6935 3055.0933 3058.8141 3081.3839 3083.9325 3112.8704 3115.7697 3121.4023 3122.9758 3124.9708 3126.3269 3127.9616 3138.8101 3145.4875 3150.6060 3151.6052 3155.4161 3552.8165
redmass: 4.7191 4.6132 6.0784 5.4442 4.8780 3.4769 5.8578 2.6531 3.6957 3.3574 3.5252 3.0851 3.4329 3.3771 3.2608 2.0462 3.0970 2.9161 3.3449 3.6026 2.6623 1.5895 1.9896 1.3742 1.5556 3.2058 2.5667 4.1682 3.2077 4.2369 3.9136 4.0697 4.3559 3.1441 3.3433 2.8048 5.0558 5.2910 3.3623 3.3121 3.3548 3.2786 5.6129 4.3103 1.3993 3.9817 3.8468 4.6649 3.8890 3.5961 4.9265 5.0240 4.8929 4.6598 4.9410 3.4983 3.9871 3.6437 2.3651 1.7453 3.0530 1.9251 1.9350 1.5589 1.6366 1.6311 1.8729 1.7775 2.1043 2.9078 3.0507 2.2316 5.2903 1.3801 6.0483 7.5782 2.5841 4.7241 2.0521 3.2029 2.9361 1.3022 1.2724 1.2623 1.2631 1.8312 1.9392 1.3221 1.3633 1.4127 1.4015 1.5655 1.5376 1.4806 1.3823 1.8295 2.0683 1.6351 1.3261 3.3591 1.4304 2.2618 2.0834 1.9051 2.1110 1.5654 1.4710 1.3324 4.3804 2.9561 2.8044 3.4345 2.1900 1.6559 1.1912 1.1788 1.3174 1.4416 1.1213 1.0919 1.0512 1.0576 1.0500 1.1258 1.1233 1.1196 1.1731 1.0869 2.0079 1.8008 2.5833 3.7193 7.1119 7.5146 6.0093 6.3891 6.4703 6.8606 1.0339 1.0324 1.0327 1.0344 1.0611 1.0592 1.0614 1.1022 1.1036 1.1040 1.1022 1.1000 1.0978 1.1044 1.0868 1.0916 1.1001 1.0974 1.1042 1.0896 1.0998 1.0973 1.0908 1.0918 1.0914 1.0944 1.0779
irintensity: 1.3612 0.4580 2.5354 0.6880 0.6144 3.8303 6.1709 3.7573 5.4385 6.0201 12.1900 4.8614 1.7101 1.2515 2.7375 3.0371 5.3849 1.6790 4.4215 0.7913 0.6612 0.2515 1.4371 0.7533 0.2668 3.3283 5.2359 2.4760 4.0097 4.4554 1.0732 1.8922 5.4285 8.8976 1.4289 6.0196 7.2473 8.8643 5.3757 6.1702 4.4518 8.4678 18.0961 2.8733 124.0512 8.3198 18.0719 4.9025 11.4293 7.1032 5.8966 5.0907 5.2827 17.9272 15.0652 7.3995 4.8523 12.2680 12.3294 43.9737 6.6213 16.3457 6.4611 12.2546 13.3582 33.3451 15.3030 1.0250 3.7657 22.8966 10.5992 15.2669 28.7425 3.1655 42.4099 40.5652 6.4764 41.6147 5.9219 7.5744 79.3598 36.7192 1.1283 0.0806 1.0697 75.9626 42.0258 19.4218 17.1185 15.0648 15.4521 28.3746 10.1297 9.9996 41.5590 46.6040 89.4190 51.6210 1.7137 160.0877 19.2018 83.2265 55.5935 110.5029 58.6042 1.9449 14.4008 8.7924 6.7711 3.9256 19.6385 7.2602 3.6933 5.7859 16.9517 46.6732 18.9836 1.4814 27.6467 19.3929 3.5187 23.3082 16.0742 74.0266 20.9011 15.8755 134.0593 27.3166 28.1588 222.1638 111.0653 76.5453 3.5000 72.2991 56.6342 39.5531 95.6339 11.2400 72.5166 63.3023 48.3401 101.9159 32.9549 24.7605 39.8190 66.4835 35.3369 45.3398 13.9691 22.2055 37.1103 12.6473 6.0649 16.3545 23.4018 31.6622 21.7548 6.5181 23.0363 26.3894 7.6006 5.3539 5.5904 12.7770 15.9821
temp: 298.150 k
press: 1.00000 atm
elementType: 8 8 8 8 8 7 6 6 6 6 6 6 6 6 6 6 6 6 6 6 6 6 6 6 6 6 6 6 6 6 1 1 1 1 1 1 1 1 1 1 1 1 1 1 1 1 1 1 1 1 1 1 1 1 1 1 1
symmnumber: 1
zpe: 1207825.1 jmol-1
zpe.correction: 0.460036 hartree
zpe.thermalcorrener: 0.489894 hartree
zpe.thermalcorrenthalpy: 0.490838 hartree
zpe.thermalcorrgfe: 0.394905 hartree
zpe.sumelectzpe: -1359.387477 hartree
zpe.sumelectthermal: -1359.357620 hartree
zpe.sumelectthermalent: -1359.356676 hartree
zpe.sumelectthermalfe: -1359.452609 hartree
dipole: -1.2629 -1.6785 0.8150
dipole: 2.2531
quadrupole: -190.4979 -153.0533 -173.7723
quadrupole: 0.8128 5.3847 -2.4758
quadrupole: -18.0567 19.3878 -1.3311 0.8128 5.3847 -2.4758
hfenergy: -1359.8475137 hartree
pointgroup: C01[X(C24H27N1O5)]
dipole: 0.3798156 0.7524206 0.2745585 debye
polarizability: 312.1806153|34.1048082|384.2135453|21.0965064|5.1383318|194.6501202 unknown
InChI: InChI=1S/C24H27NO5/c1-27-20-8-6-17(12-21(20)28-2)13-24(26)25-10-9-16-5-7-18-14-22(29-3)23(30-4)15-19(18)11-16/h5-8,11-12,14-15,25H,9-10,13H2,1-4H3
charge 0 multiplicity 1
57 atoms
O  2.794947 3.118699 0.033114
O  5.395496 2.023345 0.035781
O  -3.153613 -3.431524 0.559124
O  -4.380815 1.136277 -1.48647
O  -3.184778 3.298024 -0.528758
N  -0.950052 -3.329982 1.295619
C  -0.029852 -3.778353 -1.011605
C  1.143618 -2.821509 -0.885878
C  2.035053 -0.538974 -0.539353
C  -0.476427 -4.364498 0.362789
C  3.384588 -1.060206 -0.53671
C  0.938637 -1.444227 -0.717435
C  2.489069 -3.325429 -0.881484
C  3.579127 -2.468907 -0.712744
C  1.830699 0.868529 -0.359922
C  4.475804 -0.14774 -0.37554
C  2.91325 1.736829 -0.189892
C  -2.583831 -1.735545 2.248375
C  4.268131 1.220577 -0.209679
C  -2.264607 -2.902739 1.300762
C  -2.688514 -0.396366 1.515965
C  -3.483953 -0.287864 0.342908
C  -2.032379 0.750595 2.005084
C  -3.624044 0.944168 -0.327294
C  -2.96865 2.11193 0.186826
C  -2.175776 1.999235 1.348006
C  1.439587 3.667096 0.115961
C  5.600812 3.201174 -0.833962
C  -5.070438 -0.036404 -2.034779
C  -2.591842 4.519293 0.012872
H  -0.904124 -3.273119 -1.460601
H  0.232799 -4.629615 -1.669111
H  0.36029 -4.909093 0.836842
H  -1.312632 -5.066512 0.201426
H  -0.082737 -1.041899 -0.728226
H  2.654687 -4.40082 -1.02327
H  4.60134 -2.86578 -0.719197
H  0.801761 1.243142 -0.344034
H  -0.254606 -2.797628 1.821114
H  5.508602 -0.511976 -0.374514
H  -3.555226 -1.97998 2.718349
H  -1.834747 -1.660569 3.057851
H  -3.982659 -1.188205 -0.029796
H  -1.416336 0.68759 2.909516
H  -1.679191 2.881699 1.763664
H  0.891947 3.529862 -0.837078
H  0.869813 3.19253 0.938173
H  1.575622 4.739496 0.320607
H  5.68396 2.887394 -1.892761
H  4.780167 3.927371 -0.716753
H  6.554292 3.636515 -0.498006
H  -4.353329 -0.832659 -2.312856
H  -5.808738 -0.441889 -1.316373
H  -5.586519 0.333592 -2.932562
H  -2.91434 5.319395 -0.66931
H  -1.484105 4.464478 0.022936
H  -2.958638 4.729278 1.036891
