program: Gaussian 09
title: 000290301
version: EM64L-G09RevD.01
frameworkgroup: C1[X(C9H10O3)]
method: RPBEPBE
basis: SDD
operation: Freq
keyword: #pfreq=noraman
keyword: PBEPBE/SDD
title: #p freq=noraman PBEPBE/SDD
converged: YES YES NO NO
title: Mulliken charges:
elementType: O O O C C C C C C C C C H H H H H H H H H H
charge: -0.268325 -0.414622 -0.224700 0.400544 -0.378527 -0.395728 -0.387331 -0.222144 -0.216312 -0.348000 -0.241721 0.200930 0.194764 0.255937 0.225100 0.269308 0.224339 0.224301 0.270595 0.222926 0.226561 0.382106
chargesum: 0.00000
title: Mulliken charges with hydrogens summed into heavy atoms:
elementType: O O O C C C C C C C C C
charge: -0.268325 -0.032516 -0.224700 0.400544 0.072174 -0.170628 -0.118023 0.002195 0.007989 0.145521 -0.015161 0.200930
polarizability: 1.45404839e+02 2.86622248e-01 9.62942430e+01 7.47097631e+00 3.28940601e+00 6.51387974e+01
1716.lowfreq: -14.2354 -6.7789 -0.0008 -0.0005 -0.0004 4.2508 10.9871 34.2648 42.0042
frequency: -7.1790 34.2489 41.9885 109.7733 140.6527 213.8231 242.9811 271.3516 360.7460 401.0724 459.0882 466.7672 484.8023 570.6478 615.3011 623.9972 643.3770 702.0983 738.5524 809.3191 824.5866 855.0904 901.9475 911.3446 977.7812 989.2974 993.7007 1010.3130 1015.5722 1024.0235 1028.3428 1081.6079 1106.8900 1171.3593 1185.0126 1201.8746 1224.8114 1234.6305 1257.7917 1314.9933 1355.5681 1367.2799 1392.0623 1426.8506 1439.4659 1472.8631 1486.0092 1594.9784 1618.5562 1678.1321 2929.9067 2941.8020 3000.2038 3074.9342 3110.9199 3125.7830 3139.6510 3158.0013 3174.4678 3514.8019
redmass: 5.0060 5.5597 5.3183 4.2009 4.3927 2.5920 5.5120 5.6135 3.7005 2.8346 3.8754 3.3403 1.9439 5.0051 6.1295 1.6236 3.9999 2.2262 1.4150 4.0927 4.4937 1.2514 2.8738 1.6570 1.3815 6.1183 1.3546 2.1111 1.9152 2.7524 2.2454 1.6144 4.8447 1.0531 1.1109 1.2534 1.9479 1.1050 1.6968 1.3579 1.4872 1.8800 3.2229 1.1013 2.0730 1.1154 2.2390 6.1725 6.0486 8.7492 1.0618 1.0679 1.0980 1.0914 1.0874 1.0868 1.0930 1.0983 1.0966 1.0642
irintensity: 0.9787 0.5740 0.3686 4.7428 3.9061 7.4614 3.1788 0.8842 3.1805 0.3988 23.1403 12.8979 30.2044 8.9138 1.9485 117.5821 36.7282 30.5411 82.9574 1.8511 4.3582 0.1386 12.5492 5.6491 0.0429 0.4347 0.1848 27.0130 63.6185 346.6370 54.8978 7.9492 34.6006 0.2258 1.4773 2.2538 12.1356 6.4454 23.0132 2.9440 4.6238 9.4819 4.0256 26.6906 10.4220 11.5211 12.9799 1.1233 7.7031 212.1702 38.6101 49.8860 16.6948 8.9155 10.6518 1.2258 34.4310 31.8746 6.8815 24.6576
temp: 298.150 k
press: 1.00000 atm
elementType: 8 8 8 6 6 6 6 6 6 6 6 6 1 1 1 1 1 1 1 1 1 1
symmnumber: 1
zpe: 450057.8 jmol-1
zpe.correction: 0.171418 hartree
zpe.thermalcorrener: 0.181847 hartree
zpe.thermalcorrenthalpy: 0.182791 hartree
zpe.thermalcorrgfe: 0.133806 hartree
zpe.sumelectzpe: -573.722673 hartree
zpe.sumelectthermal: -573.712244 hartree
zpe.sumelectthermalent: -573.711299 hartree
zpe.sumelectthermalfe: -573.760285 hartree
dipole: -1.6338 -1.1769 -1.1257
dipole: 2.3068
quadrupole: -54.4548 -64.6536 -75.8876
quadrupole: 0.9198 1.0444 2.3767
quadrupole: 10.5439 0.3450 -10.8889 0.9198 1.0444 2.3767
hfenergy: -573.8940908 hartree
pointgroup: C01 [X(C9H10O3)]
dipole: 0.6447227 -0.4993489 -0.3983407 debye
dipolederiv: -1.1634701 -0.0506556 -0.0343623 0.0697489 -0.399899 0.0022838 -0.2246033 0.0356602 -0.3645988 -1.4631451 0.1138447 0.0440576 0.0450489 -0.3210537 -0.0913323 0.1379352 -0.0888834 -0.3743018 -0.8280616 0.0349493 0.0420101 0.2440545 -0.7058034 0.2295496 -0.1451182 0.267237 -0.4269997 0.2610255 -0.000651 -0.096991 0.0099847 -0.0405641 -0.0051515 -0.1881506 0.0100906 0.0036914 0.5946734 0.0169423 0.1229634 -0.0049502 0.4071736 0.0229932 0.478497 0.0132801 0.2854562 -0.1675463 -0.0038696 0.0022797 0.0119944 -0.1314653 0.0958997 -0.0059984 0.1026659 0.0407249 -0.0809045 0.0376248 0.076176 0.0217175 -0.1133242 0.0426422 0.1439532 0.0513907 -0.073553 0.0399087 0.0422636 0.0539855 0.0401221 -0.1054817 0.0808964 0.0722534 0.0806226 -0.0048949 -0.017012 -0.0117691 -0.0396783 -0.0080586 -0.0990436 0.1138973 -0.0468945 0.1124836 0.0854247 0.848972 0.0162307 -0.0613845 -0.1588422 0.1575316 0.1600689 -0.1105309 0.1447561 0.1728906 0.0495519 -0.0099868 -0.0435395 -0.015024 -0.1554108 0.0409163 -0.0546042 0.0393424 -0.0890501 1.7104574 -0.1497336 -0.1079143 -0.2455619 0.7982254 -0.3531532 -0.0122663 -0.4035906 0.4258331 -0.0514078 0.05314 0.0039867 0.0422465 -0.1248892 -0.125896 -0.0524777 -0.0889664 -0.0160085 -0.0187324 -0.0146425 0.0421281 0.0048983 0.0067071 0.0861139 -0.0552552 0.0523232 -0.0286972 0.0781278 0.0303087 0.0624237 0.0255482 0.0968447 -0.1081818 0.044678 -0.1043566 -0.0636521 0.0675398 -0.0439565 -0.0752562 -0.0617207 0.1269362 -0.0442845 -0.0927287 -0.0544402 0.0636287 -0.0512999 -0.0573377 -0.0890807 -0.0631594 0.1167697 -0.072925 -0.0980946 -0.0736375 0.0255459 0.0606716 0.0159144 0.0422214 0.027213 0.1023635 -0.1097502 0.0569185 -0.1091656 -0.0729523 -0.047315 -0.0094448 -0.0503625 -0.0172735 0.1235817 -0.009046 -0.0785468 0.0193694 0.0057322 -0.026699 -0.0176811 0.0265573 0.0654266 -0.0762288 -0.0673214 0.1241754 -0.1154231 0.0325398 -0.1265489 0.014812 0.0659337 0.0148236 0.1464662 -0.0355682 0.0667147 -0.0359098 0.082261 0.3312145 -0.0063021 0.013846 -0.048237 0.1905641 0.1473486 0.040144 0.1451514 0.2909797 unknown
polarizability: 145.2520952|1.8626269|69.3514575|-6.7553632|11.7998219|92.2343268 unknown
InChI: InChI=1S/C9H10O3/c10-9(11)7-12-6-8-4-2-1-3-5-8/h1-5,10H,6-7H2
charge 0 multiplicity 1
22 atoms
O  1.17878 -0.196125 0.39579
O  4.602766 0.416198 -0.832412
O  2.669578 1.612247 -1.334718
C  -1.165285 -0.235189 -0.265578
C  0.266759 -0.341067 -0.755723
C  -2.218295 -0.712519 -1.086009
C  -1.475618 0.364739 0.978513
C  -3.56324 -0.585536 -0.673656
C  -2.821701 0.486168 1.393316
C  2.564307 -0.443924 0.082316
C  -3.869904 0.015467 0.56962
C  3.221597 0.650893 -0.76474
H  0.437498 -1.327016 -1.243114
H  0.488857 0.457698 -1.492186
H  -1.989094 -1.18581 -2.0497
H  -0.658778 0.72068 1.612407
H  -4.368093 -0.958955 -1.316973
H  -3.051346 0.949395 2.359791
H  3.098559 -0.503422 1.045673
H  2.711739 -1.412849 -0.445643
H  -4.912588 0.111864 0.892713
H  5.036497 1.120563 -1.386588
