program: Gaussian 09
title: 000290300
version: EM64L-G09RevD.01
frameworkgroup: C1[X(C16H16O3)]
method: RPBEPBE
basis: SDD
operation: Freq
keyword: #pfreq=noraman
keyword: PBEPBE/SDD
title: #p freq=noraman PBEPBE/SDD
converged: YES YES NO NO
title: Mulliken charges:
elementType: O O O C C C C C C C C C C C C C C C C H H H H H H H H H H H H H H H H
charge: -0.268651 -0.252419 -0.249149 0.385465 -0.368809 0.460779 -0.486215 -0.385635 -0.381264 -0.400102 -0.376755 -0.365356 0.288086 -0.224350 -0.216019 -0.225102 -0.229527 -0.242490 -0.230882 0.194187 0.257365 0.227047 0.243433 0.263676 0.218725 0.224727 0.273364 0.235059 0.267424 0.223279 0.223257 0.229215 0.230441 0.225576 0.231620
chargesum: 0.00000
title: Mulliken charges with hydrogens summed into heavy atoms:
elementType: O O O C C C C C C C C C C C C C C C C
charge: -0.268651 -0.252419 -0.249149 0.385465 0.082743 0.460779 -0.015736 0.096765 -0.156537 -0.126737 -0.141696 -0.097932 0.288086 -0.001070 0.007238 0.004113 0.000914 -0.016914 0.000738
polarizability: 2.27927605e+02 3.97195104e+00 1.82818894e+02 -2.90162944e+01 1.53807467e+00 1.12866386e+02
1716.lowfreq: -7.6991 -5.0275 -0.0007 -0.0003 0.0003 1.0015 3.0870 11.0227 25.2398
frequency: -5.7575 10.6777 25.1209 32.8671 46.7548 67.0737 100.3149 136.7242 161.2269 194.1712 206.1982 223.8175 267.4467 321.3959 364.4596 372.5794 401.8742 403.3432 446.6346 463.9389 503.5165 535.1201 589.0455 607.0828 616.0940 617.2084 659.4892 702.5489 702.8505 737.9186 755.4065 806.6696 817.3055 822.5929 856.4712 857.0668 869.9755 908.0715 917.4983 936.0982 976.5010 978.7456 982.0835 989.3705 990.5454 993.6861 1001.3634 1006.0550 1019.9308 1026.8187 1027.1417 1076.2321 1084.4099 1091.2776 1132.1429 1170.9990 1174.0095 1185.4957 1189.6891 1207.1722 1222.5152 1222.6384 1230.6122 1233.4543 1314.5705 1330.8779 1335.4101 1349.1052 1364.4042 1385.8363 1392.7178 1429.1398 1439.2392 1442.5655 1462.2939 1472.7988 1484.9770 1485.9820 1594.4860 1594.7820 1614.5161 1618.7334 1646.2750 2923.4833 2941.8286 3003.6452 3040.7808 3076.2873 3110.1053 3117.0520 3121.4922 3125.1445 3129.5275 3139.1025 3141.5890 3152.5305 3157.9666 3166.1312 3177.8371
redmass: 4.1642 5.1338 4.0454 4.6072 4.1144 7.8101 4.0969 4.5446 5.2668 6.1316 2.8749 4.3632 5.5458 3.6481 3.2551 2.9704 2.8401 2.8056 4.4370 2.8174 4.6631 3.3281 5.3075 4.4860 6.2955 6.1896 6.0844 2.2368 1.8673 1.3704 2.1311 4.2543 3.5746 5.0610 1.2545 1.2872 5.0133 1.3693 4.1020 1.5270 1.8694 1.3749 1.4166 6.1917 5.5365 1.3683 1.3356 2.0832 1.8079 2.2098 2.1708 3.4769 2.1472 1.5188 4.6029 1.0521 1.0541 1.1129 1.1179 1.2708 2.1726 2.4526 1.1498 1.1125 1.3705 1.2589 1.2304 1.3637 1.8991 8.1846 3.2118 1.1372 1.9614 2.1756 1.1319 1.1166 2.2877 2.2187 6.0883 6.1454 6.0709 6.0011 9.5177 1.0639 1.0677 1.0953 1.0588 1.0918 1.0873 1.1067 1.0874 1.0868 1.0875 1.0932 1.0921 1.0964 1.0988 1.1016 1.0956
irintensity: 0.0258 0.0935 0.0671 0.1064 0.8415 2.1160 3.1444 2.1350 3.3042 8.2227 4.8753 3.9465 9.2456 3.0453 4.9009 9.7756 0.0590 0.0312 2.5153 9.2987 6.7259 1.4652 11.1688 16.0197 0.6132 0.7804 18.9248 11.3633 70.2341 84.2402 67.8670 1.6411 10.5598 0.6723 0.2512 1.7839 51.9635 6.7954 37.4472 0.8921 7.5446 0.0455 0.3714 0.2870 0.5598 0.2735 0.3317 0.8343 5.4095 11.7420 13.8195 320.4906 231.4229 6.1890 94.5653 0.2124 0.0371 1.3379 0.0658 2.8214 11.6952 19.7938 13.2388 4.8331 3.0644 0.4644 8.4219 11.6934 4.3079 0.8522 2.8880 19.8227 11.6065 8.9520 15.3131 14.9825 7.0927 14.2633 1.5566 1.2724 0.3852 11.6252 151.6707 37.5370 44.0599 14.7954 31.9242 8.7603 10.6522 4.1165 5.5313 1.2785 1.5692 35.9108 18.3224 26.6056 33.9641 18.1102 6.1139
temp: 298.150 k
press: 1.00000 atm
elementType: 8 8 8 6 6 6 6 6 6 6 6 6 6 6 6 6 6 6 6 1 1 1 1 1 1 1 1 1 1 1 1 1 1 1 1
symmnumber: 1
zpe: 733076.1 jmol-1
zpe.correction: 0.279214 hartree
zpe.thermalcorrener: 0.295635 hartree
zpe.thermalcorrenthalpy: 0.296579 hartree
zpe.thermalcorrgfe: 0.231354 hartree
zpe.sumelectzpe: -843.583475 hartree
zpe.sumelectthermal: -843.567054 hartree
zpe.sumelectthermalent: -843.566110 hartree
zpe.sumelectthermalfe: -843.631335 hartree
dipole: 2.9071 0.7100 -1.3993
dipole: 3.3035
quadrupole: -99.9047 -99.7663 -114.3785
quadrupole: -2.3790 -3.7011 -0.8478
quadrupole: 4.7785 4.9169 -9.6953 -2.3790 -3.7011 -0.8478
hfenergy: -843.862689 hartree
pointgroup: C01 [X(C16H16O3)]
dipole: 1.1491845 -0.2064671 -0.570937 debye
polarizability: 228.1381592|-18.1951101|149.5290771|-22.565554|-34.9721861|145.9456494 unknown
InChI: InChI=1S/C16H16O3/c17-16(19-12-15-9-5-2-6-10-15)13-18-11-14-7-3-1-4-8-14/h1-10H,11-13H2
charge 0 multiplicity 1
35 atoms
O  -1.733864 -1.276702 0.573128
O  1.88128 -1.509542 1.209636
O  0.517145 0.386618 1.342293
C  -3.486382 0.084949 -0.436665
C  -1.99759 -0.212114 -0.410498
C  3.800536 -0.0660 0.509653
C  3.073672 -0.697707 1.674884
C  -0.386078 -1.793049 0.53237
C  -4.002034 0.942896 -1.441399
C  -4.368045 -0.455186 0.529222
C  4.83557 -0.769706 -0.157905
C  3.457952 1.240274 0.072862
C  0.676327 -0.823648 1.072077
C  -5.377948 1.257785 -1.47955
C  -5.746487 -0.140966 0.489288
C  5.51406 -0.182337 -1.248585
C  4.136655 1.828647 -1.016872
C  -6.256954 0.715758 -0.512223
C  5.165457 1.119015 -1.680072
H  -1.654117 -0.545178 -1.416238
H  -1.421607 0.691887 -0.128322
H  3.687388 -1.452639 2.189806
H  2.702981 0.057639 2.388526
H  -0.380746 -2.702762 1.155821
H  -0.08197 -2.084977 -0.497855
H  -3.327744 1.367345 -2.19684
H  -3.964774 -1.119147 1.298468
H  5.107021 -1.778593 0.176547
H  2.653146 1.780552 0.583598
H  -5.763546 1.921256 -2.262106
H  -6.420845 -0.565609 1.241937
H  6.313204 -0.733034 -1.75707
H  3.866982 2.838065 -1.346562
H  -7.325314 0.958113 -0.541098
H  5.69357 1.576898 -2.524055
