program: Gaussian 09
title: 000290290
version: EM64L-G09RevD.01
frameworkgroup: C1[X(C17H12N2)]
method: RPBEPBE
basis: SDD
operation: Freq
keyword: #pfreq=noraman
keyword: PBEPBE/SDD
title: #p freq=noraman PBEPBE/SDD
converged: NO NO NO NO
title: Mulliken charges:
elementType: N N C C C C C C C C C C C C C C C C C H H H H H H H H H H H H
charge: 0.010120 0.003321 -0.671010 0.197370 0.316590 0.274047 -0.163680 -0.110376 -0.419407 -0.407149 0.377394 -0.224240 -0.231608 -0.409443 -0.392145 -0.392005 -0.224565 -0.224561 -0.237577 0.259884 0.259890 0.246367 0.275385 0.228956 0.232566 0.250016 0.243501 0.243524 0.229114 0.229112 0.230610
chargesum: 0.00000
title: Mulliken charges with hydrogens summed into heavy atoms:
elementType: N N C C C C C C C C C C C C C C C C C
charge: 0.010120 0.003321 -0.151236 0.197370 0.316590 0.274047 -0.163680 -0.110376 -0.173040 -0.131765 0.377394 0.004717 0.000958 -0.159427 -0.148643 -0.148481 0.004548 0.004551 -0.006967
polarizability: 2.76097635e+02 -1.36142753e+00 1.88629270e+02 2.59321190e-02 2.68491810e-02 1.18002698e+02
1716.lowfreq: -54.7386 -4.1255 0.0001 0.0002 0.0005 4.5381 10.6018 50.7258 55.6576
frequency: -54.7355 50.7066 55.6576 98.7043 137.9324 192.1605 225.7503 243.7781 259.6810 302.0082 316.7604 396.1609 414.7065 426.0517 464.5118 491.3648 545.1879 550.9027 579.2809 611.8594 621.5351 633.5420 663.0477 699.4238 704.2561 726.6104 766.5636 773.6207 791.1002 816.7398 819.8829 851.0171 853.1018 882.9977 922.6996 934.9529 946.5899 970.6497 975.1726 987.7194 996.2779 997.4548 1011.3502 1020.8690 1042.0897 1078.3630 1082.1666 1092.0704 1129.3273 1131.0565 1166.7059 1173.1713 1187.6557 1192.1237 1194.5594 1248.3794 1274.6831 1290.5425 1298.6403 1311.9657 1353.5156 1369.6467 1401.9914 1403.8241 1422.9627 1428.0015 1454.6711 1466.1813 1480.8348 1525.4215 1557.6113 1584.9213 1592.3022 1615.1480 1624.6703 2987.1568 3029.5539 3123.1484 3124.5110 3128.9191 3137.8559 3140.2665 3149.7336 3152.1361 3159.9096 3164.3650 3166.9539
redmass: 3.9133 4.2536 5.3166 5.3043 4.5785 4.9542 2.5178 5.4515 5.9789 5.9039 4.1855 2.8141 6.4433 2.9833 2.7819 4.1097 3.3765 6.2189 4.2630 6.3559 7.2908 6.7131 6.0723 5.3493 1.7500 2.2902 2.1714 1.6659 4.1675 7.4708 3.9738 5.6254 1.2446 1.4230 1.4526 1.8345 1.5545 1.5759 1.3898 5.8178 1.3392 1.3329 3.4081 2.4885 2.7274 1.6055 5.3301 2.3839 2.5712 1.1524 1.2182 1.0532 1.1230 2.2145 1.6923 4.2790 3.9120 2.0646 2.6014 1.3621 4.3599 7.0877 1.5533 4.1054 1.1858 2.1932 2.5020 3.0371 2.5032 8.4946 10.0641 6.0151 6.7830 6.3631 7.5380 1.0615 1.0988 1.0846 1.0865 1.0878 1.0903 1.0926 1.0970 1.0946 1.0918 1.1018 1.0998
irintensity: 0.0385 0.0627 0.5218 0.0142 0.0632 0.1067 7.5770 0.4995 2.1660 0.9919 0.1975 0.0056 0.7038 8.2116 0.0166 6.1952 3.2213 0.0570 7.8827 0.2809 20.3331 6.2120 2.7431 7.0279 48.5915 15.0135 52.2467 73.5862 0.4429 9.3108 0.0381 8.5374 0.0043 1.5015 1.6945 0.1332 8.2592 5.7508 0.0943 1.7991 0.0515 0.0195 2.3649 15.9791 1.3965 8.5056 1.1060 4.0589 3.0403 0.3710 3.2655 0.0154 2.8620 1.4193 10.3464 7.0355 27.1346 12.2826 4.3197 0.7003 32.9389 0.0156 13.9790 27.0979 10.7882 8.6647 4.6044 3.5922 43.9658 89.3117 187.7888 1.1082 3.6525 2.9510 16.1502 7.5272 3.4917 1.6055 0.9585 0.1648 12.0548 16.6981 34.5849 21.0411 24.5051 24.5671 24.8020
temp: 298.150 k
press: 1.00000 atm
elementType: 7 7 6 6 6 6 6 6 6 6 6 6 6 6 6 6 6 6 6 1 1 1 1 1 1 1 1 1 1 1 1
symmnumber: 1
zpe: 630252.9 jmol-1
zpe.correction: 0.240051 hartree
zpe.thermalcorrener: 0.253034 hartree
zpe.thermalcorrenthalpy: 0.253978 hartree
zpe.thermalcorrgfe: 0.199965 hartree
zpe.sumelectzpe: -763.246195 hartree
zpe.sumelectthermal: -763.233212 hartree
zpe.sumelectthermalent: -763.232268 hartree
zpe.sumelectthermalfe: -763.286281 hartree
dipole: -0.3336 -4.0021 0.0017
dipole: 4.0159
quadrupole: -97.8285 -109.7418 -106.1363
quadrupole: -2.9686 0.0088 0.0130
quadrupole: 6.7403 -5.1729 -1.5675 -2.9686 0.0088 0.0130
hfenergy: -763.4862461 hartree
pointgroup: C01 [X(C17H12N2)]
dipole: 0.146811 1.5731554 0.0001287 debye
polarizability: 276.0621132|-2.2268317|188.6647603|-0.0391832|-0.0498504|118.0027288 unknown
InChI: InChI=1S/C17H12N2/c1-2-6-12(7-3-1)16-15-10-13-8-4-5-9-14(13)17(15)19-11-18-16/h1-9,11H,10H2
charge 0 multiplicity 1
31 atoms
N  1.253201 -2.453873 0.000157
N  -1.191069 -2.260542 0.000275
C  0.562728 1.206584 0.000121
C  0.148954 -0.253463 0.000149
C  2.087832 1.122473 0.000042
C  2.510727 -0.242483 0.000045
C  1.311013 -1.093284 0.000118
C  -1.111636 -0.878304 0.00022
C  3.04326 2.153858 -0.000034
C  3.877901 -0.588861 -0.000019
C  -2.395093 -0.102002 0.000263
C  4.420052 1.810522 -0.000102
C  4.833374 0.453519 -0.000093
C  -0.022955 -2.958956 0.000245
C  -3.003768 0.27479 -1.223475
C  -3.005549 0.271739 1.224047
C  -4.209479 1.012755 -1.223015
C  -4.21125 1.00972 1.223662
C  -4.815117 1.383267 0.000347
H  0.172367 1.746392 0.884897
H  0.172276 1.7464 -0.88461
H  2.738906 3.20692 -0.000041
H  4.181944 -1.640458 -0.000014
H  5.174509 2.605528 -0.000163
H  5.901987 0.212134 -0.000146
H  -0.10948 -4.049959 0.000285
H  -2.542125 -0.022813 -2.171923
H  -2.545288 -0.028236 2.172418
H  -4.676411 1.293556 -2.173828
H  -4.679551 1.288177 2.174491
H  -5.75066 1.953996 0.000378
