program: Gaussian 09
title: 000290288
version: EM64L-G09RevD.01
frameworkgroup: C1[X(C17H11ClN2)]
method: RPBEPBE
basis: SDD
operation: Freq
keyword: #p
keyword: freq=noraman
keyword: PBEPBE/SDD
title: #p freq=noraman PBEPBE/SDD
converged: NO YES NO NO
title: Mulliken charges:
elementType: Cl N N C C C C C C C C C C C C C C C C C H H H H H H H H H H H
charge: -0.054724 0.011345 0.002912 -0.670237 0.198058 0.314916 0.272720 -0.161339 -0.112832 -0.417671 -0.405541 0.387910 -0.223050 -0.231007 -0.407026 -0.377279 -0.377107 -0.208992 -0.208979 -0.107203 0.259895 0.259899 0.247394 0.276283 0.230158 0.233764 0.251428 0.250132 0.250158 0.258008 0.258007
chargesum: 0.00000
title: Mulliken charges with hydrogens summed into heavy atoms:
elementType: Cl N N C C C C C C C C C C C C C C C C C
charge: -0.054724 0.011345 0.002912 -0.150443 0.198058 0.314916 0.272720 -0.161339 -0.112832 -0.170277 -0.129258 0.387910 0.007108 0.002758 -0.155598 -0.127147 -0.126949 0.049016 0.049028 -0.107203
polarizability: 3.06443242e+02 -8.74648001e-01 1.96179081e+02 2.35384374e-02 -3.57411620e-02 1.19623211e+02
1716.lowfreq: -54.3991 -2.0426 -0.0019 -0.0017 -0.0012 6.4264 9.3832 35.6662 42.4082
frequency: -54.3712 35.6592 42.3649 95.3082 124.6479 127.0728 210.4503 216.2944 235.2658 251.6014 272.3793 333.0393 333.0694 400.4274 424.3013 427.0170 446.0728 463.6072 497.6649 544.5841 552.1015 576.6723 616.6808 624.4061 664.0264 667.0901 709.6820 724.5419 725.8733 773.7978 787.6740 815.5322 819.8818 828.4871 831.4968 855.3206 881.5159 934.8002 948.5716 952.5282 967.0138 969.5679 997.7664 998.6899 1013.8465 1034.8859 1071.8730 1082.6398 1091.9930 1105.8030 1126.0718 1129.9397 1166.2944 1184.7925 1190.9772 1192.9255 1242.4928 1274.5307 1290.6566 1291.6147 1298.9095 1353.3688 1355.6718 1387.2088 1403.8154 1404.7420 1421.5343 1455.4636 1468.2619 1477.2570 1520.9242 1555.4157 1578.2014 1592.0682 1605.8072 1624.8928 2988.5450 3031.6800 3126.6042 3139.5687 3143.1774 3144.2857 3154.3734 3158.1421 3168.7954 3170.7897 3174.1114
redmass: 3.9281 9.4372 4.8480 5.7114 7.5877 4.9627 6.7988 3.3624 8.3708 4.3094 4.9697 4.9811 5.6705 2.8893 2.9686 6.5165 8.1599 2.8006 3.8354 3.3889 6.1328 4.0743 6.8129 7.2420 7.2348 6.0537 5.7734 3.8936 2.2637 1.6880 4.6512 6.0273 3.8931 1.9386 1.2441 4.2009 1.4325 1.8961 1.5171 1.3607 1.3715 1.5754 1.3350 4.9089 2.5538 4.0152 2.8814 5.0389 2.4025 1.3647 1.1571 2.5209 1.2342 1.1274 1.7763 2.0129 4.4756 3.7126 2.0884 1.2523 2.6645 5.5368 4.3654 3.5998 1.6234 3.6700 1.1803 2.5319 3.1257 2.6923 8.4672 10.0037 7.6737 6.8476 6.6761 7.5312 1.0613 1.0989 1.0867 1.0901 1.0897 1.0896 1.0946 1.0919 1.0999 1.0957 1.0970
irintensity: 0.0274 0.3213 0.4581 0.1589 0.5476 0.3511 0.2197 3.7202 0.0117 6.3066 0.2124 0.0717 0.1288 0.0219 8.5164 3.7167 20.7203 0.0136 19.6122 3.1909 1.4571 8.8306 0.0153 8.8182 2.8476 3.4478 6.2372 5.2135 16.9098 70.8226 15.4659 10.7217 0.0517 67.8162 0.0067 12.4262 1.7166 0.0006 8.3877 0.1720 0.0002 5.4851 0.0093 61.8248 5.7632 2.8470 50.2153 0.3295 0.2007 8.9250 0.2328 6.0427 4.1478 2.5982 10.3494 1.4455 8.2218 24.5440 14.9686 0.3979 3.1722 0.6825 35.7309 5.5548 18.7296 25.9676 9.1174 5.3419 0.0384 132.4662 76.2128 149.2262 1.3192 1.2446 57.5876 17.7623 7.9404 3.4634 1.1599 11.2139 4.1749 5.4873 20.1682 22.1477 26.2967 5.7427 0.3323
temp: 298.150 k
press: 1.00000 atm
elementType: 17 7 7 6 6 6 6 6 6 6 6 6 6 6 6 6 6 6 6 6 1 1 1 1 1 1 1 1 1 1 1
symmnumber: 1
zpe: 604709.3 jmol-1
zpe.correction: 0.230322 hartree
zpe.thermalcorrener: 0.244628 hartree
zpe.thermalcorrenthalpy: 0.245572 hartree
zpe.thermalcorrgfe: 0.187910 hartree
zpe.sumelectzpe: -1222.636207 hartree
zpe.sumelectthermal: -1222.621901 hartree
zpe.sumelectthermalent: -1222.620956 hartree
zpe.sumelectthermalfe: -1222.678618 hartree
dipole: 2.0228 -3.2132 -0.0016
dipole: 3.7969
quadrupole: -125.7955 -123.5614 -116.4708
quadrupole: -6.7832 0.0058 -0.0191
quadrupole: -3.8529 -1.6188 5.4718 -6.7832 0.0058 -0.0191
hfenergy: -1222.8665285 hartree
pointgroup: C01 [X(C17H11Cl1N2)]
dipole: 0.8810427 1.2063221 -0.0003279 debye
polarizability: 306.0399072|-6.7138447|196.5823198|-0.0304183|-0.091082|119.6233072 unknown
InChI: InChI=1S/C17H11ClN2/c18-13-7-5-11(6-8-13)16-15-9-12-3-1-2-4-14(12)17(15)20-10-19-16/h1-8,10H,9H2
charge 0 multiplicity 1
31 atoms
Cl -6.195819 1.704358 -0.000545
N  1.775546 -2.427124 0.001121
N  -0.677976 -2.439264 0.00115
C  0.780093 1.163878 -0.000377
C  0.490718 -0.326372 0.000218
C  2.307808 1.207184 -0.000404
C  2.842473 -0.116535 0.000131
C  1.718214 -1.063266 0.00053
C  -0.712424 -1.056728 0.00053
C  3.174508 2.314871 -0.00087
C  4.234494 -0.349983 0.000212
C  -2.055536 -0.390461 0.000257
C  4.573379 2.086209 -0.000793
C  5.098719 0.767142 -0.000257
C  0.54819 -3.036492 0.00143
C  -2.695862 -0.065022 -1.22141
C  -2.697762 -0.067847 1.221674
C  -3.956837 0.57217 -1.230563
C  -3.958736 0.569354 1.230332
C  -4.567717 0.88127 -0.000231
H  0.347092 1.669304 0.884707
H  0.34709 1.668611 -0.885853
H  2.783558 3.338702 -0.001287
H  4.621419 -1.373726 0.000627
H  5.26086 2.939586 -0.001153
H  6.183991 0.618451 -0.00021
H  0.550808 -4.131196 0.001865
H  -2.217803 -0.320981 -2.173097
H  -2.221181 -0.326017 2.173502
H  -4.452931 0.818442 -2.17379
H  -4.456277 0.813486 2.173352
