program: Gaussian 09
title: 000290283
version: EM64L-G09RevD.01
frameworkgroup: C1[X(C16H12ClNO5)]
method: RPBEPBE
basis: SDD
operation: Freq
keyword: #p
keyword: freq=noraman
keyword: PBEPBE/SDD
title: #p freq=noraman PBEPBE/SDD
converged: YES YES NO NO
title: Mulliken charges:
elementType: Cl O O O O O N C C C C C C C C C C C C C C C C H H H H H H H H H H H H
charge: -0.058724 -0.261490 -0.259007 -0.265274 -0.258352 -0.237745 -0.023603 0.604109 0.194317 0.196806 -0.446265 -0.330372 -0.335561 -0.455641 0.220449 0.176930 -0.203157 0.485559 -0.483949 -0.328561 -0.382375 -0.201601 -0.355684 0.284174 0.280339 0.223635 0.238820 0.244132 0.237325 0.280967 0.254286 0.233689 0.241038 0.239642 0.251148
chargesum: 0.00000
title: Mulliken charges with hydrogens summed into heavy atoms:
elementType: Cl O O O O O N C C C C C C C C C C C C C C C C
charge: -0.058724 -0.261490 -0.259007 -0.265274 -0.258352 -0.237745 -0.023603 0.604109 0.194317 0.196806 -0.162091 -0.330372 -0.055223 0.006814 0.220449 0.176930 0.278300 0.485559 -0.202982 -0.074275 -0.148687 0.279079 -0.104536
polarizability: 3.21583278e+02 -3.94724971e+01 2.23887124e+02 -2.93027068e+00 -1.02141417e+01 1.35389878e+02
1716.lowfreq: -38.2025 -3.4721 -0.0017 0.0013 0.0018 1.9750 2.5403 8.6711 17.9044
frequency: -38.1944 8.2566 17.8825 18.6092 60.8055 64.6759 79.4338 98.9786 134.9050 174.6203 186.4701 203.4333 221.0345 241.2408 249.7016 268.7631 288.9926 323.9591 349.7710 364.0809 372.1102 411.0198 422.7621 435.2747 478.5128 518.8102 537.1127 549.2365 608.7456 611.6644 650.8278 669.4194 680.9352 681.4408 707.9924 720.6839 754.8306 765.1208 784.8309 794.6216 810.8257 836.7213 842.4870 852.7788 858.8604 890.0706 894.0786 918.4505 926.1695 942.2886 952.5403 955.3494 972.1184 980.5677 997.7369 1062.1451 1065.2231 1069.7354 1074.8579 1120.1096 1125.8058 1133.1865 1156.0532 1191.7915 1218.7682 1246.6630 1250.4049 1254.2152 1265.5928 1336.3471 1337.9255 1360.4349 1365.3521 1384.1251 1386.0069 1419.0833 1450.3256 1456.2818 1463.5344 1478.5750 1485.0070 1486.7559 1552.9219 1606.2073 1607.3726 1624.3736 1624.7334 3006.6036 3015.4784 3025.7370 3067.8612 3094.9702 3111.4709 3113.0330 3142.5127 3179.6466 3183.7883 3187.3850 3195.8414
redmass: 2.2999 8.0354 7.3927 6.1616 7.1553 5.9232 2.6246 9.1734 9.8027 10.0578 4.6813 5.7306 7.2452 8.1003 7.9269 7.5924 3.9100 6.2981 12.1710 5.1090 5.4824 4.3505 3.6195 3.2041 5.3104 3.9508 5.8734 6.5889 5.9726 4.7198 7.6502 9.1797 9.6337 9.3180 4.7878 4.3239 5.5763 6.6994 5.9787 5.1876 1.3492 7.5317 10.3551 1.4830 5.7637 1.5207 1.3875 5.0797 1.4030 4.1797 2.2001 2.4331 4.2615 4.2551 2.1265 3.9178 1.4593 1.5190 3.5506 1.0373 1.0585 1.4402 2.0136 1.7000 1.2823 1.3637 2.0330 5.1148 1.6756 1.7888 1.3093 1.3640 1.3081 3.4576 3.9396 6.9742 1.1766 4.4322 2.4553 2.6337 1.2407 1.2937 6.9955 8.6465 7.8802 9.1327 8.0286 1.0597 1.0537 1.0620 1.0894 1.1187 1.1119 1.1027 1.0900 1.0932 1.0952 1.0939 1.0940
irintensity: 15.2137 0.0407 0.4168 0.2692 0.4258 2.9570 12.1294 0.3703 2.8229 1.9632 10.5527 0.5874 0.5361 0.6594 0.6671 1.7671 1.4062 1.7741 1.3221 0.0449 0.4779 9.8157 17.8654 5.8387 8.6944 26.3850 40.8922 31.8713 3.3928 12.9568 12.5497 6.9689 0.3884 4.8009 0.9632 2.8315 5.2034 15.7289 3.5057 21.1877 38.8263 30.8523 20.3542 18.2808 86.0644 85.4702 17.1537 186.4721 24.9306 67.2533 45.9163 183.7489 71.1192 134.4969 6.3410 22.8590 4.3350 7.0531 58.0434 0.0177 1.6054 3.3599 10.5752 29.8474 1.6566 9.0035 228.7283 180.0475 90.2928 17.0975 14.3237 1.7117 1.2070 25.3231 57.3800 8.2652 45.9418 117.3988 170.3629 78.0801 21.4811 30.6818 1.2109 7.7451 4.2913 12.2333 3.8561 108.6861 133.6836 36.8324 11.3675 30.5449 28.8325 2.4915 8.1920 1.4381 4.8066 2.6937 0.7504
temp: 298.150 k
press: 1.00000 atm
elementType: 17 8 8 8 8 8 7 6 6 6 6 6 6 6 6 6 6 6 6 6 6 6 6 1 1 1 1 1 1 1 1 1 1 1 1
symmnumber: 1
zpe: 652723.5 jmol-1
zpe.correction: 0.248609 hartree
zpe.thermalcorrener: 0.267824 hartree
zpe.thermalcorrenthalpy: 0.268768 hartree
zpe.thermalcorrgfe: 0.196507 hartree
zpe.sumelectzpe: -1506.082961 hartree
zpe.sumelectthermal: -1506.063747 hartree
zpe.sumelectthermalent: -1506.062803 hartree
zpe.sumelectthermalfe: -1506.135064 hartree
dipole: -2.1473 2.5975 0.5719
dipole: 3.4183
quadrupole: -129.1387 -128.4951 -135.0291
quadrupole: 3.5594 0.9897 -0.1563
quadrupole: 1.7490 2.3925 -4.1414 3.5594 0.9897 -0.1563
hfenergy: -1506.3315706 hartree
pointgroup: C01 [X(C16H12Cl1N1O5)]
dipole: 0.6421289 1.1613526 0.218221 debye
polarizability: 304.0135963|52.5665431|220.49281|15.2328866|43.215796|156.3538736 unknown
InChI: InChI=1S/C16H12ClNO5/c17-12-5-16-15(21-9-22-16)4-11(12)7-23-18-6-10-1-2-13-14(3-10)20-8-19-13/h1-6H,7-9H2
charge 0 multiplicity 1
35 atoms
Cl -4.51055 -3.190626 -1.198223
O  -3.107639 2.193361 1.025561
O  -5.257324 1.899292 -0.002604
O  4.245959 1.434259 2.027073
O  5.90433 1.79034 0.324885
O  -0.580278 -2.442939 -0.770784
N  0.433819 -1.568848 -0.179494
C  -2.7026 -1.452858 0.103984
C  -3.246787 0.867927 0.540882
C  -4.513206 0.699207 -0.06141
C  -2.335225 -0.178571 0.641904
C  -3.979457 -1.585162 -0.492882
C  -4.918555 -0.525985 -0.590348
C  -1.706575 -2.591116 0.191191
C  3.86862 0.782784 0.826428
C  4.848831 0.994112 -0.173359
C  -4.305217 2.917644 0.527263
C  2.571562 -0.545713 -0.705996
C  2.726424 0.024785 0.600851
C  4.72379 0.447532 -1.452175
C  3.563237 -0.329977 -1.703487
C  5.532516 2.115444 1.730958
C  1.401158 -1.360734 -1.049606
H  -1.350531 -0.048737 1.097547
H  -5.898021 -0.664916 -1.051006
H  -1.273932 -2.66379 1.204548
H  -2.165619 -3.550572 -0.092752
H  -4.781259 3.447174 1.366608
H  -4.006234 3.589311 -0.298744
H  1.973642 -0.143344 1.374047
H  5.484176 0.61137 -2.219297
H  3.427361 -0.774935 -2.695493
H  6.31227 1.723644 2.405508
H  5.393201 3.206875 1.81977
H  1.349619 -1.799038 -2.059047
