program: Gaussian 09
title: 000290282
version: EM64L-G09RevD.01
frameworkgroup: C1[X(C17H16N2O3S)]
method: RPBEPBE
basis: SDD
operation: Freq
keyword: #p
keyword: freq=noraman
keyword: PBEPBE/SDD
title: #p freq=noraman PBEPBE/SDD
converged: YES YES NO NO
title: Mulliken charges:
elementType: S O O O N N C C C C C C C C C C C C C C C C C H H H H H H H H H H H H H H H H
charge: 0.201612 -0.223330 -0.183246 -0.264247 -0.330770 -0.701712 -0.590232 -0.500245 0.294009 0.150879 0.383515 0.239019 -0.366347 -0.316927 -0.341921 0.509424 -0.245050 -0.234691 -0.225082 -0.397087 -0.269816 -0.199773 -0.532711 0.342663 0.267909 0.286751 0.248237 0.243060 0.232841 0.245723 0.228476 0.215900 0.228281 0.222194 0.296814 0.383086 0.228198 0.221807 0.252789
chargesum: 0.00000
title: Mulliken charges with hydrogens summed into heavy atoms:
elementType: S O O O N N C C C C C C C C C C C C C C C C C
charge: 0.201612 -0.223330 -0.183246 -0.264247 -0.330770 -0.021812 -0.247569 0.054415 0.294009 0.150879 0.383515 0.239019 -0.366347 -0.068691 -0.098861 0.509424 -0.012210 0.011032 0.003394 -0.181186 -0.041535 0.022421 0.170083
polarizability: 3.33054258e+02 2.00497397e+00 1.95407176e+02 1.30461372e+01 8.12889690e+00 1.68185173e+02
1716.lowfreq: -5.2026 -3.5455 -0.0014 -0.0007 0.0005 4.1434 14.6965 25.5062 32.5657
frequency: 12.9666 25.4464 32.4263 51.0398 57.6182 74.8649 95.1122 98.5580 124.0770 160.7920 175.9977 179.8066 223.7200 233.7487 242.5968 253.8270 272.3577 282.8978 310.8283 352.4311 377.4093 429.8555 441.4996 450.7430 461.3335 470.1972 488.6896 529.3478 533.1386 544.2203 553.1797 557.5458 574.5579 595.0778 610.2188 658.5948 667.0334 669.2669 702.5924 720.0404 731.7780 752.2281 752.6485 757.6301 772.1311 830.7121 843.0645 846.6852 912.2816 933.0524 937.4515 947.7127 969.1855 976.1128 988.7619 1002.3305 1012.8644 1036.6911 1039.7665 1045.3404 1052.1389 1105.9895 1114.6933 1136.5845 1138.8982 1149.3765 1160.8426 1169.8173 1171.0299 1175.1294 1189.1841 1231.0369 1240.7669 1264.4038 1268.0410 1276.9913 1328.0006 1349.9706 1383.6530 1386.7407 1431.0113 1437.4023 1439.7681 1450.6649 1469.2667 1470.7580 1485.1017 1495.3838 1562.9235 1596.9314 1610.4686 1610.6449 1628.5150 1664.7375 1697.1374 2967.7737 3029.4908 3059.8868 3069.7619 3090.1786 3115.8406 3133.5406 3135.9663 3137.7237 3144.3074 3153.3636 3165.8649 3168.7741 3177.2303 3402.2083 3638.8658
redmass: 5.2240 4.7863 6.2505 5.7845 6.1295 3.9126 3.8005 5.2605 6.2041 5.0065 7.0592 3.2290 3.3401 2.9433 1.7273 7.3143 4.2547 5.8967 4.2157 5.7045 7.0493 2.6654 1.6456 2.6276 3.4607 4.0771 4.3066 3.9861 4.0507 5.6801 4.5266 5.5133 3.7533 5.2314 7.1275 5.6116 1.8209 2.2536 4.9705 3.2399 3.3641 1.6931 1.5282 2.4142 4.9956 4.7686 1.5432 1.4771 6.9928 1.4010 1.3689 2.0586 1.3165 1.3263 8.7498 3.8831 4.4155 2.1712 2.1564 2.1565 2.0725 2.4212 1.2571 1.2705 1.2260 1.7462 2.9671 1.2776 1.3750 1.1331 1.5239 1.8841 2.1932 1.5820 1.5601 1.5058 1.9458 4.6786 6.2616 9.9650 1.3793 1.1395 2.3277 1.8759 1.0786 1.0714 3.2696 2.6086 6.2662 7.5968 6.2757 6.7297 8.3109 1.2243 11.7315 1.0327 1.0614 1.1043 1.0883 1.1001 1.0866 1.0997 1.0883 1.0864 1.0941 1.0900 1.0940 1.1001 1.1004 1.0600 1.0913
irintensity: 0.5430 0.5397 0.0460 0.4314 0.6720 6.9456 8.3644 4.0709 0.2890 0.8490 2.2607 0.4257 4.2555 2.7199 1.0703 1.3056 3.7370 4.4766 2.4121 3.2235 1.6482 34.2750 60.7945 13.9113 4.1390 13.2730 2.3579 4.0719 2.7948 3.8911 4.5544 5.2471 0.1547 7.7703 12.7635 16.7616 199.1177 42.3435 12.8599 2.4530 1.3292 79.0995 68.8974 13.5422 15.1837 5.0556 3.4840 3.8031 29.2856 0.5663 0.8041 6.8808 0.3321 0.2680 41.7686 6.4953 6.7478 1.5046 6.0859 0.3914 22.9887 30.3694 0.0799 22.8477 19.7030 34.5268 158.4887 32.5669 21.3366 11.8609 45.8802 37.4303 69.8975 4.5709 20.0443 18.7984 15.8128 226.3463 30.6300 26.0928 13.6478 21.3544 1.7497 19.7459 41.7051 31.7036 76.5766 97.2585 4.5839 13.5514 74.6604 38.9142 420.9254 190.6035 61.7514 60.5227 6.5313 36.6903 0.7918 1.4544 9.7512 16.1440 6.1804 1.6565 27.3653 11.8697 17.1668 28.6190 13.5498 393.1463 60.3168
temp: 298.150 k
press: 1.00000 atm
elementType: 16 8 8 8 7 7 6 6 6 6 6 6 6 6 6 6 6 6 6 6 6 6 6 1 1 1 1 1 1 1 1 1 1 1 1 1 1 1 1
symmnumber: 1
zpe: 779479.9 jmol-1
zpe.correction: 0.296888 hartree
zpe.thermalcorrener: 0.317987 hartree
zpe.thermalcorrenthalpy: 0.318931 hartree
zpe.thermalcorrgfe: 0.244508 hartree
zpe.sumelectzpe: -1389.020053 hartree
zpe.sumelectthermal: -1388.998954 hartree
zpe.sumelectthermalent: -1388.998010 hartree
zpe.sumelectthermalfe: -1389.072433 hartree
dipole: -0.9798 -2.1305 -1.0190
dipole: 2.5568
quadrupole: -127.4405 -137.7548 -133.7708
quadrupole: 15.7404 -4.8283 -5.1339
quadrupole: 5.5482 -4.7661 -0.7821 15.7404 -4.8283 -5.1339
hfenergy: -1389.3169411 hartree
pointgroup: C01 [X(C17H16N2O3S1)]
dipole: -0.2849335 0.9293779 0.2588229 debye
polarizability: 330.4931123|-22.0409579|200.5510675|0.9547695|3.9958874|165.6024273 unknown
InChI: InChI=1S/C17H16N2O3S/c1-22-13-8-4-3-7-12(13)19-16(20)10-15(17(19)21)23-14-9-5-2-6-11(14)18/h2-9,15H,10,18H2,1H3
charge 0 multiplicity 1
39 atoms
S  2.000915 -0.477559 -1.113133
O  -0.125923 1.293135 0.695153
O  -2.531065 -2.630977 -0.251559
O  -2.007608 1.37626 -1.729041
N  -1.608041 -0.490278 0.206463
N  2.808711 1.680408 1.042605
C  0.723971 -1.004945 0.233233
C  -0.060912 -2.284578 -0.113459
C  -0.332577 0.088885 0.407091
C  -1.540766 -1.892581 -0.071786
C  -2.830391 0.268099 0.215771
C  -3.025679 1.264751 -0.783562
C  3.556368 -0.357931 -0.137324
C  -3.826159 0.019743 1.178036
C  -4.211309 2.037673 -0.770313
C  3.779822 0.732629 0.77007
C  -5.019034 0.776829 1.177188
C  4.568241 -1.316857 -0.376435
C  -5.198909 1.788641 0.209127
C  5.062286 0.808392 1.404113
C  5.826947 -1.221168 0.254154
C  6.06163 -0.145241 1.146821
C  -2.100405 2.456996 -2.715031
H  1.318934 -1.090883 1.156519
H  0.126826 -3.112131 0.591416
H  0.173541 -2.660482 -1.12435
H  -3.660819 -0.765007 1.922698
H  -4.37545 2.818426 -1.518598
H  -5.792086 0.581523 1.926408
H  4.357861 -2.135939 -1.072676
H  -6.115792 2.388271 0.20808
H  5.257651 1.635096 2.098642
H  6.604061 -1.965293 0.0549
H  7.03255 -0.051761 1.647261
H  3.015769 2.43041 1.697563
H  1.846908 1.611856 0.686983
H  -2.140574 3.444567 -2.217945
H  -2.983981 2.326163 -3.368984
H  -1.180008 2.376657 -3.3106
