program: Gaussian 09
title: 000290273
version: EM64L-G09RevD.01
frameworkgroup: C1[X(C20H22N8O5)]
method: RPBEPBE
basis: SDD
operation: Freq
keyword: #p
keyword: freq=noraman
keyword: PBEPBE/SDD
title: #p freq=noraman PBEPBE/SDD
converged: YES YES NO NO
title: Mulliken charges:
elementType: O O O O O N N N N N N N N C C C C C C C C C C C C C C C C C C C C H H H H H H H H H H H H H H H H H H H H H H
charge: -0.319563 -0.399531 -0.236470 -0.414166 -0.234070 -0.166711 -0.416172 0.007586 0.039290 -0.036494 -0.095895 -0.639500 -0.582962 -0.139829 -0.406550 0.361263 0.138057 -0.539059 -0.471778 0.166463 -0.371806 0.252341 -0.360240 -0.646010 0.128496 -0.236005 -0.286927 0.190717 -0.447083 -0.132906 -0.038535 0.135361 -0.035275 0.302202 0.289183 0.247034 0.230770 0.235043 0.355085 0.259213 0.246648 0.221169 0.242719 0.224700 0.276948 0.215254 0.226539 0.232884 0.243086 0.392022 0.380678 0.312668 0.439321 0.327490 0.333300
chargesum: 0.00000
title: Mulliken charges with hydrogens summed into heavy atoms:
elementType: O O O O O N N N N N N N N C C C C C C C C C C C C C C C C C C C C
charge: -0.319563 -0.007509 -0.236470 -0.033488 -0.234070 -0.166711 -0.061087 0.007586 0.039290 -0.036494 -0.095895 0.112489 0.077829 0.162373 0.129667 0.361263 0.138057 -0.073245 0.034083 0.166463 -0.150637 0.252341 -0.117520 0.070893 0.128496 -0.009466 -0.054042 0.190717 -0.203998 -0.132906 -0.038535 0.135361 -0.035275
polarizability: 3.55763337e+02 -1.14453456e+01 2.92561699e+02 1.55480834e+01 2.42067795e+01 2.67245831e+02
1716.lowfreq: -4.2901 -3.2404 -0.0010 -0.0008 -0.0007 0.1860 12.5074 18.0553 22.1856
frequency: 12.3153 17.9610 22.1415 24.8200 27.3968 40.4786 50.7218 56.0418 65.9477 71.2258 80.7140 87.2069 100.9681 115.1427 148.9686 159.4167 169.6456 176.8074 178.8195 205.3496 211.9414 212.7898 228.3400 274.0575 284.0689 307.5358 313.9297 324.1168 332.6103 342.2737 368.6332 377.1939 406.9066 415.6509 432.7686 440.0700 467.0642 470.8342 476.9009 490.4850 503.3764 526.2384 540.6434 543.3371 549.1488 555.8688 558.8859 565.2756 577.5103 599.2497 602.3328 608.1871 631.3347 635.7709 645.3757 647.7960 669.6424 684.0467 703.8593 705.7515 722.5556 734.1614 746.8560 755.4178 760.3969 779.4410 811.4433 826.3574 833.4909 845.6757 877.6654 880.2011 898.1766 903.1873 913.0357 937.9057 941.2071 948.8099 958.1935 974.4445 996.2042 1020.1245 1033.4967 1036.5839 1054.2864 1071.8706 1076.1967 1085.6054 1095.4547 1105.6569 1112.5745 1128.7571 1133.5356 1157.9261 1181.6149 1187.8105 1190.7497 1212.5855 1216.8778 1235.4522 1246.4448 1256.9699 1260.2759 1276.0020 1284.8852 1288.5624 1290.9832 1320.5759 1341.3886 1345.0610 1351.9980 1363.0010 1374.7795 1374.9249 1388.6636 1412.4349 1419.9569 1440.1766 1443.8975 1451.5329 1461.5985 1467.3325 1471.1176 1473.3637 1479.5317 1481.8549 1504.5242 1521.7380 1529.4723 1551.4632 1564.3673 1568.7517 1601.9712 1611.4002 1642.0794 1650.7032 1660.8893 2973.3719 2981.7929 2986.2923 3016.6160 3028.8941 3029.6472 3063.1280 3070.5451 3079.9538 3097.3164 3099.5812 3122.7205 3133.5125 3163.5930 3176.3839 3315.9366 3506.0039 3515.9124 3517.3054 3557.7135 3621.9681 3719.6991
redmass: 7.9638 6.7785 11.1382 6.7001 7.0271 6.5456 6.8666 8.0940 5.6239 4.6410 3.4828 5.1819 4.1069 5.5593 6.6673 4.6729 5.6370 5.0791 5.7254 5.4192 6.3842 6.6032 3.7336 5.6726 1.4907 2.0111 3.5375 4.1526 4.5570 4.6560 4.3385 4.5873 2.8094 3.4906 4.4494 4.9495 5.2570 1.2103 4.1329 3.3635 7.9975 2.6149 2.8192 3.0737 3.7431 3.4198 2.4515 1.6860 2.7369 1.5245 2.4265 3.3131 1.3996 2.6806 3.8862 2.4835 1.5602 5.9516 6.1434 4.0583 4.3470 9.6288 4.0790 1.5034 4.8263 1.5442 4.7427 10.2744 6.6258 1.6359 1.3576 2.4343 4.3753 1.5390 3.2195 2.3137 1.8329 2.0547 3.9394 1.3289 2.2724 2.5654 3.1997 3.0539 2.3580 2.4243 2.8675 2.2199 3.5049 1.3359 1.7935 2.3223 2.1680 2.3876 1.1286 1.4144 1.6148 2.1851 1.3643 1.5662 1.4809 2.0542 3.2333 1.7821 4.2274 1.2387 1.6765 1.9212 1.4930 2.5368 2.3836 2.2582 7.2895 1.7726 4.7109 3.8000 1.4609 1.8640 1.1339 3.7606 1.4671 1.4533 2.6792 1.1174 1.2920 1.3639 1.7810 3.8272 4.6107 4.8176 4.0773 6.1211 1.5140 5.8898 1.7321 8.6385 8.3337 1.0340 1.0651 1.0599 1.0772 1.0654 1.1005 1.1013 1.0958 1.1000 1.1028 1.0913 1.0873 1.0888 1.0945 1.0964 1.0648 1.0638 1.0708 1.0714 1.0439 1.0890 1.1060
irintensity: 0.0505 0.0738 1.8146 0.0637 0.6466 1.2502 0.3901 0.0876 2.2164 3.2898 0.9274 1.7741 0.4558 3.8324 1.2690 10.4963 4.0804 4.0418 3.4757 12.1759 1.6251 3.0468 3.0371 0.8155 2.1869 3.6679 7.8334 2.2137 1.7387 0.8209 3.3701 0.6774 1.1277 24.7892 25.4258 0.1940 8.8734 258.4169 3.0281 4.9295 0.0571 47.9063 36.7781 17.0109 3.8392 30.0970 19.7057 8.3136 57.5923 124.4262 12.9098 29.3672 0.1921 45.6408 36.1338 83.0749 110.7361 1.8146 6.0333 26.5596 10.1891 3.4910 6.3085 74.2167 7.0915 34.7031 5.1823 2.2377 2.1526 5.5105 76.6557 73.5493 19.9427 5.1363 6.9942 10.5473 20.0787 16.1596 15.9102 0.5334 13.1040 98.9763 11.2457 211.7742 35.9051 173.3674 1.1968 189.8119 7.9363 12.5314 6.3481 18.1648 11.8784 1.0491 1.0819 5.4634 20.5822 41.5467 11.5108 77.8598 7.5713 24.9916 24.9249 7.8603 22.2104 0.7660 27.5577 55.0250 50.8958 150.5419 13.1510 17.2985 89.7255 112.2537 5.9172 163.2795 35.7927 46.2895 18.2115 79.1341 286.1153 167.0650 12.1597 15.6086 43.0916 71.3963 171.4699 164.5170 46.7321 269.8591 424.0046 41.8028 611.8225 123.5181 279.5773 162.7868 217.1190 60.1538 8.6328 45.0458 9.4498 19.7306 9.9028 16.4518 3.9452 33.7789 13.1797 30.3817 5.1042 11.9997 26.2664 17.4899 837.4220 29.5526 100.0121 15.1790 168.5028 74.3529 46.7106
temp: 298.150 k
press: 1.00000 atm
elementType: 8 8 8 8 8 7 7 7 7 7 7 7 7 6 6 6 6 6 6 6 6 6 6 6 6 6 6 6 6 6 6 6 6 1 1 1 1 1 1 1 1 1 1 1 1 1 1 1 1 1 1 1 1 1 1
symmnumber: 1
zpe: 1102828.0 jmol-1
zpe.correction: 0.420045 hartree
zpe.thermalcorrener: 0.450628 hartree
zpe.thermalcorrenthalpy: 0.451572 hartree
zpe.thermalcorrgfe: 0.354281 hartree
zpe.sumelectzpe: -1587.123309 hartree
zpe.sumelectthermal: -1587.092727 hartree
zpe.sumelectthermalent: -1587.091782 hartree
zpe.sumelectthermalfe: -1587.189074 hartree
dipole: -6.9340 -0.4396 -0.8872
dipole: 7.0044
quadrupole: -190.3918 -180.1993 -173.7138
quadrupole: 6.2637 -6.8722 12.1621
quadrupole: -8.9569 1.2357 7.7212 6.2637 -6.8722 12.1621
hfenergy: -1587.5433545 hartree
pointgroup: C01 [X(C20H22N8O5)]
dipole: -2.6133344 0.0840468 0.8703515 debye
polarizability: 348.9208838|19.5735981|279.4696962|-24.9155498|24.1683224|287.1802871 unknown
InChI: InChI=1S/C20H22N8O5/c1-28(9-10-8-23-17-15(24-10)16(21)26-20(22)27-17)13-5-3-2-4-11(13)18(31)25-12(19(32)33)6-7-14(29)30/h2-5,8,12,25,29,32H,6-7,9,21-22H2,1H3
charge 0 multiplicity 1
55 atoms
O  -0.627745 0.42063 0.930495
O  -4.801451 1.114933 3.712416
O  -4.81732 -1.081103 2.952485
O  -6.282268 2.051014 -1.568168
O  -4.007735 2.421642 -1.843345
N  -0.1223 -1.269344 -1.9131
N  -2.618019 -0.65748 1.376452
N  2.162262 0.060971 -1.153165
N  4.676172 -0.187601 -2.502987
N  5.711447 1.111846 -0.795545
N  4.361782 1.931615 1.118698
N  2.062839 1.439384 1.278077
N  6.63698 2.392394 0.918875
C  -3.188897 0.528883 2.020832
C  -3.667508 1.596974 0.987368
C  -0.087112 -2.171612 -0.838064
C  -0.811021 -1.978493 0.396395
C  0.980742 -1.233826 -2.887155
C  -4.807361 1.086278 0.079772
C  -1.3217 -0.653993 0.883069
C  0.628208 -3.407846 -0.979933
C  2.264336 -0.623996 -2.314062
C  -0.906271 -3.048572 1.333636
C  -1.037619 -0.117918 -1.9589
C  -4.329471 0.071858 2.922305
C  0.546403 -4.429606 -0.022605
C  -0.250154 -4.275017 1.138083
C  -4.942288 1.918628 -1.18071
C  3.534496 -0.740784 -2.968724
C  3.299891 0.620366 -0.651573
C  4.582654 0.525379 -1.309689
C  3.24383 1.351169 0.61356
C  5.528672 1.78323 0.381276
H  -2.409774 1.011808 2.641018
H  -2.790666 1.866221 0.373947
H  -3.987954 2.499924 1.536461
H  0.644074 -0.625652 -3.748256
H  1.192804 -2.238295 -3.298949
H  -3.173579 -1.518071 1.37865
H  -5.780508 1.054564 0.597603
H  -4.578901 0.051415 -0.249815
H  1.239413 -3.584807 -1.868071
H  -1.453086 -2.878138 2.269106
H  -2.005999 -0.38646 -1.502264
H  -0.636236 0.768311 -1.433869
H  -1.231825 0.142047 -3.014461
H  1.103212 -5.359156 -0.187099
H  -0.320947 -5.071643 1.884552
H  3.623168 -1.306778 -3.905777
H  -5.555138 0.796431 4.279753
H  -6.32982 2.570358 -2.417316
H  2.043956 1.950739 2.15904
H  1.204653 0.979853 0.928071
H  6.548864 2.899538 1.794881
H  7.523214 2.315987 0.426823
