program: Gaussian 09
title: 000290272
version: EM64L-G09RevD.01
frameworkgroup: C1[X(C7H12N2O4)]
method: RPBEPBE
basis: SDD
operation: Freq
keyword: #p
keyword: freq=noraman
keyword: PBEPBE/SDD
title: #p freq=noraman PBEPBE/SDD
converged: NO YES NO NO
title: Mulliken charges:
elementType: O O O O N N C C C C C C C H H H H H H H H H H H H
charge: -0.259716 -0.415844 -0.437446 -0.278801 -0.124558 -0.406073 -0.268342 -0.143660 -0.154750 -0.061474 -0.331996 0.190672 -0.618939 0.288714 0.272206 0.271977 0.245663 0.330424 0.214174 0.220328 0.361660 0.279899 0.232004 0.237620 0.356259
chargesum: 0.00000
title: Mulliken charges with hydrogens summed into heavy atoms:
elementType: O O O O N N C C C C C C C
charge: -0.259716 -0.054183 -0.081186 -0.278801 -0.124558 -0.075649 0.020372 0.128546 0.117227 0.184189 0.102506 0.190672 0.130583
polarizability: 9.96369519e+01 -7.92597547e+00 9.24907766e+01 -1.72060731e+00 -6.76538395e-01 9.42213851e+01
1716.lowfreq: -15.8185 -8.8054 -7.5500 -0.0007 0.0002 0.0004 54.0950 92.0205 94.5565
frequency: 54.0674 91.9504 94.5418 106.7831 130.3768 161.9896 187.7106 234.8808 300.8185 319.0699 355.5222 381.8536 426.9210 452.6006 462.6566 480.1839 514.7315 546.8561 574.0407 605.2350 689.7225 716.1873 737.7044 782.7745 846.6812 856.8792 902.7817 933.2606 959.6939 976.2460 1004.3237 1047.5027 1066.5482 1103.3024 1109.1616 1125.5142 1151.2227 1177.5860 1180.4609 1220.5974 1228.1604 1252.0116 1260.0179 1275.4887 1286.3569 1296.8368 1337.2512 1343.0257 1377.6124 1386.9780 1392.8561 1406.3100 1440.5600 1462.0647 1484.4703 1487.9725 1636.8013 2980.9361 2986.2588 3015.9785 3064.2530 3070.1918 3087.9693 3101.8644 3114.6311 3118.9498 3533.5112 3538.1558 3584.1275
redmass: 4.8778 2.5421 3.3753 2.0466 2.0208 3.7182 1.8794 6.1084 4.0633 3.4007 2.0332 5.1057 5.3094 2.9775 1.4799 3.1510 1.4261 3.8034 4.1165 4.4617 6.0161 7.3061 4.0247 5.0273 3.5094 3.5547 3.4833 4.0104 2.3250 2.2836 4.3234 2.4830 2.0859 1.9745 2.1660 1.3119 1.8641 1.4825 3.0575 1.7832 1.4304 1.6166 1.6908 1.5876 1.5883 1.3091 1.4560 1.2260 1.2321 1.2877 1.4875 1.5280 1.4858 1.0915 1.1007 1.0684 6.2372 1.0352 1.0636 1.0845 1.1026 1.1009 1.0888 1.0875 1.0917 1.0977 1.0651 1.0654 1.0783
irintensity: 1.5707 1.0888 8.8301 1.3971 0.7137 3.6229 21.8293 8.9760 5.2945 3.3737 77.8653 3.1662 2.1840 42.6929 75.8923 28.9367 92.0479 29.1803 34.6174 37.9619 11.2386 19.6218 21.2921 0.8216 38.8240 93.5582 46.1199 9.3817 86.4680 8.5109 9.0522 96.0936 35.3356 86.7374 9.4115 2.1422 27.9236 20.1126 9.5818 36.3126 33.0559 12.1134 72.1334 25.2532 33.6564 10.9450 22.3401 24.0460 14.7563 25.1413 43.6141 31.1295 161.2679 6.6812 17.7507 20.3682 368.7714 55.7152 29.9398 31.7126 29.7715 25.4692 19.5730 15.9511 11.7176 3.4401 9.0163 9.1740 49.9874
temp: 298.150 k
press: 1.00000 atm
elementType: 8 8 8 8 7 7 6 6 6 6 6 6 6 1 1 1 1 1 1 1 1 1 1 1 1
symmnumber: 1
zpe: 524099.2 jmol-1
zpe.correction: 0.199619 hartree
zpe.thermalcorrener: 0.212268 hartree
zpe.thermalcorrenthalpy: 0.213212 hartree
zpe.thermalcorrgfe: 0.160822 hartree
zpe.sumelectzpe: -683.308544 hartree
zpe.sumelectthermal: -683.295895 hartree
zpe.sumelectthermalent: -683.294951 hartree
zpe.sumelectthermalfe: -683.347341 hartree
dipole: 0.2067 2.0391 -0.3763
dipole: 2.0838
quadrupole: -91.8399 -82.9471 -70.7805
quadrupole: -5.3092 -6.8474 9.3874
quadrupole: -9.9841 -1.0913 11.0754 -5.3092 -6.8474 9.3874
hfenergy: -683.5081632 hartree
pointgroup: C01 [X(C7H12N2O4)]
dipole: 0.0004901 0.8197929 -0.0086834 debye
dipolederiv: -1.0371928 0.1215283 0.0098953 -0.143779 -0.467351 -0.0066275 0.1694553 0.0256339 -0.4889614 -0.774928 -0.2997447 -0.0398747 -0.1810452 -0.377133 -0.1578083 -0.0608135 -0.1933315 -0.4836075 -0.510958 -0.0899356 -0.2301272 -0.1814537 -0.6369535 -0.0469934 -0.3165286 -0.0727345 -0.448885 -0.640941 0.3558298 -0.108615 0.389279 -0.889966 0.253231 -0.1273422 0.2324948 -0.6861307 -0.619379 0.1021915 0.1350451 0.3081137 -0.70115 0.2228234 -0.0895671 0.1619576 -1.0426579 -0.7703531 0.142694 0.0736653 0.2428509 -0.7859253 -0.213266 0.2160656 -0.2989 -0.5776146 0.1855814 -0.1974751 0.086356 -0.2777352 0.2928249 -0.0438615 0.2342208 -0.008353 0.1310366 0.5068332 0.241836 0.1253653 0.1990186 0.317876 0.0492051 0.0554247 0.0676668 0.2570871 1.0644879 -0.2708589 0.1161819 -0.1962767 0.5157975 -0.2342163 0.2090675 -0.2183709 0.2800957 0.353893 0.0034849 -0.2001803 -0.1315495 0.1890993 -0.0238864 -0.3210785 0.0644162 0.2398935 0.3994774 0.0168143 0.1358639 0.0926383 0.2979548 0.1020396 0.1668142 0.0376833 0.3882772 0.7904111 -0.6036481 -0.14221 -0.6459072 1.1502821 -0.2915345 -0.1836803 -0.135812 1.4932841 0.2883165 0.0080668 -0.2145773 -0.0338954 0.1989132 0.2307979 -0.1794899 0.2078305 0.3028996 0.0518549 0.0710934 0.0196558 0.0641609 0.0322206 -0.0599722 0.0323389 -0.0764321 -0.0398487 0.0105499 0.046264 -0.0408079 0.0724448 -0.0300003 0.0459214 -0.0458247 0.0260748 0.0547814 -0.0132033 -0.0033143 0.0486243 0.0009233 0.0784799 0.0211591 0.0541157 0.0543113 -0.0588723 -0.062864 0.0993346 0.0200683 0.1137052 -0.063358 -0.0025986 0.0102837 0.0432248 0.0242829 0.2345377 0.10699 0.0542879 0.10346 0.1831913 0.0616821 0.0332387 0.0292738 0.2295558 -0.0018839 -0.003701 0.0935201 -0.0049984 0.0786815 -0.0461279 0.0642277 -0.0302629 -0.0893771 -0.0755946 0.1021254 -0.0870653 0.0939417 -0.0508238 0.0275912 -0.0459255 0.0001247 0.0218716 0.3202071 0.115527 -0.0223714 0.1047154 0.1737146 0.1316773 -0.0459643 0.1017688 0.2789453 0.0936965 0.0461976 -0.0052132 0.0682121 0.0388016 -0.0005331 -0.0782244 0.0931442 0.1217221 -0.0218536 -0.0537743 0.1131715 -0.1148627 0.0161027 0.0577926 0.1244009 -0.0042649 -0.0161201 -0.014931 -0.0843668 -0.0947583 -0.0231436 0.0542504 -0.0972516 -0.0172475 -0.1120276 -0.0618951 0.2442359 0.0268411 0.1540999 0.0811827 0.3844703 0.0207569 0.1420327 0.0048838 0.1702374 unknown
polarizability: 101.2758789|-6.6362726|91.3555993|-2.6479514|-1.4943285|93.7176353 unknown
InChI: InChI=1S/C7H12N2O4/c1-9-6-5(11)4(8-7(9)12)3(2-10)13-6/h3-6,8,10-11H,2H2,1H3
charge 0 multiplicity 1
25 atoms
O  -1.019697 0.363323 -1.278842
O  1.619328 2.377164 0.398702
O  -3.338007 -1.093499 -0.546183
O  1.766832 -1.773097 1.218482
N  1.229892 -0.39273 -0.619467
N  0.337491 0.048254 1.531713
C  -0.518242 1.117622 0.973952
C  0.359916 1.862165 -0.076061
C  0.420423 0.716308 -1.125744
C  -1.673059 0.596459 0.079402
C  -2.36966 -0.70686 0.482312
C  1.146718 -0.781895 0.733611
C  1.935876 -1.267186 -1.572555
H  -0.871828 1.771008 1.78551
H  -0.176465 2.722665 -0.503189
H  0.77737 1.01581 -2.12078
H  -2.432044 1.387759 -0.073249
H  0.251595 -0.240628 2.50579
H  -2.961028 -0.563922 1.403606
H  -1.622071 -1.507126 0.651184
H  2.087559 1.668894 0.913352
H  2.434104 -2.062962 -0.997835
H  2.697537 -0.695502 -2.13256
H  1.22766 -1.727687 -2.286291
H  -2.848397 -1.125937 -1.409458
