program: Gaussian 09
title: 000290270
version: EM64L-G09RevD.01
frameworkgroup: C1[X(C8H16N2O5)]
method: RPBEPBE
basis: SDD
operation: Freq
keyword: #p
keyword: freq=noraman
keyword: PBEPBE/SDD
title: #p freq=noraman PBEPBE/SDD
converged: YES YES NO NO
title: Mulliken charges:
elementType: O O O O O N N C C C C C C C C H H H H H H H H H H H H H H H H
charge: -0.231413 -0.477807 -0.464628 -0.294037 -0.380371 -0.441048 -0.415664 -0.069703 -0.183817 -0.078132 -0.009737 -0.358515 0.369632 -0.501443 -0.607421 0.255610 0.247514 0.203906 0.193265 0.208194 0.245329 0.322647 0.368498 0.378070 0.204516 0.232191 0.251912 0.298612 0.284843 0.223804 0.225194
chargesum: 0.00000
title: Mulliken charges with hydrogens summed into heavy atoms:
elementType: O O O O O N N C C C C C C C C
charge: -0.231413 -0.109309 -0.086559 -0.294037 -0.380371 -0.118401 -0.117052 0.185906 0.063697 0.125774 0.183528 0.095008 0.369632 0.187176 0.126420
polarizability: 1.58150172e+02 -1.25100911e+00 1.18439520e+02 -6.91920759e-01 2.05677648e+00 8.11299750e+01
1716.lowfreq: -2.7117 -0.0010 -0.0005 0.0005 5.4521 11.7979 37.5896 61.7348 83.1053
frequency: 37.4423 61.7057 83.0841 95.9057 108.1657 120.2426 129.9701 155.9412 159.3914 184.8991 225.9713 253.9228 276.4826 290.4554 304.1455 337.7616 377.6100 413.4784 427.2252 432.4654 443.7541 463.8922 525.4369 556.3890 584.2493 633.4794 655.1312 708.8558 724.6625 842.9240 859.7804 905.3676 928.7531 942.9171 972.1823 985.5753 1030.6579 1042.2346 1052.7899 1069.3288 1090.9455 1097.0477 1118.1708 1127.3552 1133.3408 1140.0045 1163.2021 1189.4197 1192.4626 1217.7848 1255.7511 1268.3106 1278.1987 1282.8421 1307.9298 1320.1652 1339.9484 1352.0265 1367.4637 1390.2173 1422.0906 1433.5947 1451.3562 1455.8499 1461.7931 1471.8725 1480.7372 1488.8999 1492.1665 1542.9811 1624.3422 2882.8641 2942.0312 2956.3180 2963.7722 2975.8821 2976.1089 2991.1020 3052.9026 3055.0387 3072.5271 3113.9107 3119.4235 3127.7662 3471.1923 3552.7293 3565.8914
redmass: 4.4700 3.5253 4.5265 2.8250 3.1392 1.3964 2.2145 1.7429 2.7458 2.8203 5.5130 3.7837 4.4933 4.6883 4.0013 4.1250 5.0478 4.7824 3.0701 1.4066 1.7669 1.7317 5.3362 4.1421 4.4105 2.3913 1.6639 9.8012 3.4249 1.0859 2.3223 4.3109 5.5001 3.3292 5.9283 7.9194 5.3640 3.4361 3.5050 3.1888 3.3209 2.4904 1.2865 1.2763 1.7949 2.4441 1.6417 3.0502 1.3106 1.2444 1.2334 1.2368 1.3476 1.3469 1.1925 1.3018 1.2273 1.3132 1.3905 1.6001 1.2167 1.1612 1.4212 1.0518 1.0847 1.2179 1.0530 1.0510 1.3529 2.1709 3.3913 1.0824 1.0815 1.0826 1.0370 1.0362 1.0693 1.0841 1.1027 1.0693 1.0958 1.0973 1.0968 1.1035 1.0764 1.0655 1.0774
irintensity: 0.4555 7.7807 1.5959 4.8015 0.9145 0.4179 6.3374 2.3862 1.9361 4.2878 2.9917 8.5578 17.2839 3.9535 4.0244 14.4160 25.4950 19.4634 11.4484 73.4833 16.9661 95.7076 2.1864 16.6207 28.1017 62.0970 100.5783 10.3869 32.6213 171.4048 0.5848 16.7393 49.8303 5.9097 63.1239 223.6750 6.6396 29.2983 18.4600 88.7843 7.7523 10.3831 2.2705 0.8243 85.5545 52.6414 11.5912 28.2925 8.7071 24.9774 73.3574 47.1340 37.3753 60.1559 14.5303 12.3088 8.7277 28.9210 0.8733 24.6724 73.3660 7.8896 136.5295 10.8189 15.8641 81.1154 19.1622 19.6587 158.9545 462.4907 118.2683 52.8945 23.4065 19.7878 66.3630 116.2135 49.3258 79.0393 45.2464 725.2659 37.1754 1.3633 17.2212 21.0440 64.0070 20.7238 21.1750
temp: 298.150 k
press: 1.00000 atm
elementType: 8 8 8 8 8 7 7 6 6 6 6 6 6 6 6 1 1 1 1 1 1 1 1 1 1 1 1 1 1 1 1
symmnumber: 1
zpe: 665018.2 jmol-1
zpe.correction: 0.253292 hartree
zpe.thermalcorrener: 0.269535 hartree
zpe.thermalcorrenthalpy: 0.270479 hartree
zpe.thermalcorrgfe: 0.209603 hartree
zpe.sumelectzpe: -798.848552 hartree
zpe.sumelectthermal: -798.832309 hartree
zpe.sumelectthermalent: -798.831365 hartree
zpe.sumelectthermalfe: -798.892240 hartree
dipole: -0.7381 -5.1725 -0.0153
dipole: 5.2250
quadrupole: -70.3124 -93.3186 -91.4435
quadrupole: -10.1632 -7.3560 0.4502
quadrupole: 14.7124 -8.2938 -6.4186 -10.1632 -7.3560 0.4502
hfenergy: -799.1018436 hartree
pointgroup: C01 [X(C8H16N2O5)]
dipole: 0.2667647 2.0302343 -0.1808395 debye
polarizability: 158.0851639|-0.4911842|117.7527133|2.764134|-5.3388418|81.88179 unknown
InChI: InChI=1S/C8H16N2O5/c1-9-8(13)10-5-4(11)3-15-7(14-2)6(5)12/h4-7,9-12H,3H2,1-2H3
charge 0 multiplicity 1
31 atoms
O  2.543861 -1.115326 -0.422581
O  0.827608 2.167149 0.189578
O  -0.783675 -2.482282 0.472569
O  3.387961 1.098312 -0.36645
O  -2.948259 -1.079822 0.136879
N  -1.358713 0.61852 -0.241373
N  -3.651547 1.061849 -0.435923
C  -0.130672 -0.063709 0.232922
C  1.036129 0.794328 -0.294817
C  0.061721 -1.542058 -0.234573
C  2.384416 0.221435 0.159692
C  1.495848 -2.012151 0.107654
C  -2.654759 0.135243 -0.154879
C  4.759111 0.743567 0.038049
C  -5.068971 0.687204 -0.452183
H  -0.106108 -0.069114 1.345443
H  1.040987 0.775763 -1.405308
H  -0.099066 -1.577574 -1.335345
H  2.454022 0.149961 1.274418
H  1.580696 -2.10103 1.211483
H  1.683579 -2.995067 -0.347712
H  -1.216181 1.629682 -0.346346
H  1.633358 2.688544 -0.061846
H  -1.738291 -2.133051 0.398113
H  4.854932 0.747568 1.143056
H  5.408805 1.517406 -0.397208
H  5.028776 -0.25086 -0.356198
H  -3.397636 2.023372 -0.662655
H  -5.130988 -0.379129 -0.184169
H  -5.513952 0.828861 -1.455079
H  -5.648188 1.27351 0.285189
