program: Gaussian 09
title: 000290264
version: EM64L-G09RevD.01
frameworkgroup: C1[X(C16H12BrClO2S)]
method: RPBEPBE
basis: SDD
operation: Freq
keyword: #p
keyword: freq=noraman
keyword: PBEPBE/SDD
title: #p freq=noraman PBEPBE/SDD
converged: YES YES NO NO
title: Mulliken charges:
elementType: Br Cl S O O C C C C C C C C C C C C C C C C H H H H H H H H H H H H
charge: 0.013064 -0.058958 0.221643 -0.238584 -0.133339 -0.269538 0.587762 -0.730542 -0.392270 0.136207 -0.321220 -0.409466 -0.274166 -0.229868 -0.195592 0.361698 -0.314358 -0.358011 -0.206401 -0.182563 -0.118013 0.256541 0.317439 0.263205 0.249555 0.243957 0.240363 0.254056 0.255185 0.250670 0.267039 0.254861 0.259642
chargesum: 0.00000
title: Mulliken charges with hydrogens summed into heavy atoms:
elementType: Br Cl S O O C C C C C C C C C C C C C C C C
charge: 0.013064 -0.058958 0.221643 -0.238584 -0.133339 -0.012997 0.587762 -0.149898 -0.392270 0.136207 -0.071665 0.074854 -0.020110 -0.229868 0.059593 0.361698 -0.063688 -0.090971 0.048461 0.077079 -0.118013
polarizability: 2.89031039e+02 -2.84210633e+01 2.27776957e+02 -5.36558538e+00 3.77212794e+00 1.45454503e+02
1716.lowfreq: -5.2153 -3.9074 -1.8210 -0.0019 -0.0013 -0.0005 8.9202 19.8216 30.5994
frequency: 8.5195 19.6602 30.5842 40.1134 68.2629 76.9173 107.9780 125.7925 147.5005 157.3020 166.6770 195.4263 217.8492 243.6151 260.2127 291.3219 297.0285 316.6374 376.0630 382.5130 415.5908 422.7808 453.1415 471.6888 497.9967 510.3576 517.7881 558.3697 587.6990 624.0461 626.6390 664.8740 693.5976 697.9567 721.6839 732.6878 784.3562 800.4544 816.3998 826.7065 827.5195 873.4795 899.9925 926.1916 940.5537 951.5506 956.8770 964.4061 991.8251 996.2990 1029.4309 1040.5520 1069.9488 1072.3395 1074.6049 1109.4318 1131.6075 1149.1897 1175.3116 1187.7671 1201.6229 1219.9768 1245.8792 1260.4543 1267.2183 1289.9418 1307.9622 1349.4487 1359.6285 1376.7182 1389.5557 1404.4245 1437.3401 1441.4319 1453.8590 1475.3910 1566.3740 1582.3191 1585.1552 1605.8024 1662.7193 2914.2573 2954.8197 2962.4614 3047.4436 3132.7162 3152.4726 3153.1442 3156.4204 3163.4121 3174.5050 3175.9943 3182.7164
redmass: 16.0036 4.4793 7.2407 7.5223 7.1131 9.3111 9.0798 8.7470 4.5595 3.6168 4.9402 6.2118 5.1282 20.0268 6.6452 7.5467 5.6959 7.0852 9.6259 5.3203 3.0063 3.2614 4.7251 5.3909 2.7233 6.9232 4.2878 3.3864 7.4337 7.1861 4.8651 4.9713 6.2058 3.5112 5.2202 4.3134 4.7572 1.3336 1.3462 1.6729 3.6472 1.4297 3.6239 1.3654 1.9223 1.3688 1.3611 2.6079 3.9921 3.5058 4.7969 3.5369 2.1322 2.5377 2.4872 1.3136 1.7085 1.3348 1.1749 2.1160 1.0877 4.0617 1.2730 1.2728 1.3885 1.2598 1.3627 1.7564 6.6653 4.2251 3.7290 3.6987 1.4068 1.6162 1.1555 2.2338 7.7165 7.4777 7.3220 6.7647 9.2494 1.0556 1.0824 1.1009 1.0574 1.1089 1.0893 1.0881 1.0924 1.0887 1.0966 1.0967 1.0979
irintensity: 0.0269 0.1770 0.1148 0.4981 1.2171 2.0342 1.4587 0.0277 3.3045 6.9079 5.5936 0.4831 0.5791 0.4139 3.3804 1.1356 0.8975 1.5390 8.4202 9.6027 0.1201 8.5392 2.4962 0.2690 21.6301 12.7872 7.0072 3.1103 6.1290 0.9655 9.9460 36.2824 2.5621 0.2692 4.0750 12.7961 5.8959 20.9949 39.3493 74.4094 9.7109 11.7475 11.5192 0.0273 1.3988 0.2743 0.8568 19.9644 22.7555 118.7724 88.5918 24.3827 27.1193 51.0854 37.1080 14.2461 16.6161 14.3986 41.0096 5.4810 1.2627 309.6088 12.0545 5.4872 7.9663 0.2201 26.8374 28.9769 8.3296 1.5796 22.3620 2.7267 99.4142 93.0799 31.2295 189.1244 4.5627 4.0238 14.4551 23.4100 86.7718 78.9421 21.9345 23.3822 11.8169 7.2970 3.0485 13.6523 3.2768 1.6749 5.2894 4.0711 0.7825
temp: 298.150 k
press: 1.00000 atm
elementType: 35 17 16 8 8 6 6 6 6 6 6 6 6 6 6 6 6 6 6 6 6 1 1 1 1 1 1 1 1 1 1 1 1
symmnumber: 1
zpe: 615940.8 jmol-1
zpe.correction: 0.234599 hartree
zpe.thermalcorrener: 0.254015 hartree
zpe.thermalcorrenthalpy: 0.254959 hartree
zpe.thermalcorrgfe: 0.181683 hartree
zpe.sumelectzpe: -1637.422163 hartree
zpe.sumelectthermal: -1637.402747 hartree
zpe.sumelectthermalent: -1637.401803 hartree
zpe.sumelectthermalfe: -1637.475079 hartree
dipole: 1.2868 -1.6746 -2.9917
dipole: 3.6620
quadrupole: -156.1860 -147.4093 -147.9039
quadrupole: 3.0442 -3.6467 5.9480
quadrupole: -5.6863 3.0904 2.5959 3.0442 -3.6467 5.9480
hfenergy: -1637.656762 hartree
pointgroup: C01 [X(C16H12Br1Cl1O2S1)]
dipole: -0.468779 -0.6984109 1.1696997 debye
polarizability: 283.6505383|33.4725437|233.2834173|-2.3603206|-3.7891851|145.3285436 unknown
InChI: InChI=1S/C16H12BrClO2S/c17-10-1-6-16-13(7-10)14(9-21-16)15(19)8-20-12-4-2-11(18)3-5-12/h1-7,14H,8-9H2
charge 0 multiplicity 1
33 atoms
Br -3.428417 3.589802 -0.11818
Cl 7.157441 2.041147 0.970323
S  -3.96387 -2.918405 0.646052
O  1.873796 -0.287797 -0.76806
O  -0.352234 -1.531612 -1.756326
C  -1.532934 -1.599197 0.392892
C  -2.657299 -0.557113 0.284902
C  -2.161427 -2.969885 0.036275
C  -3.957191 -1.103859 0.443128
C  -0.334135 -1.288996 -0.531072
C  -2.497029 0.833173 0.119193
C  0.867444 -0.676912 0.195152
C  -5.098176 -0.278178 0.445186
C  -3.646427 1.653726 0.121509
C  -4.940798 1.119559 0.286156
C  3.077365 0.249643 -0.271362
C  3.365131 0.452005 1.100622
C  4.028136 0.593498 -1.263241
C  4.614272 1.00018 1.476951
C  5.270248 1.139026 -0.888019
C  5.547838 1.335193 0.481844
H  -1.184417 -1.613819 1.448078
H  -2.172252 -3.112187 -1.055904
H  -1.661046 -3.814288 0.532609
H  -1.508374 1.279525 -0.024253
H  0.521302 0.190017 0.802106
H  1.257601 -1.439293 0.908383
H  -6.100841 -0.701315 0.558363
H  -5.81671 1.774141 0.28019
H  2.644963 0.197589 1.8837
H  3.777657 0.426409 -2.314542
H  4.848554 1.161431 2.532973
H  6.009829 1.40659 -1.647729
