program: Gaussian 09
title: 000290263
version: EM64L-G09RevD.01
frameworkgroup: C1[X(C20H15ClO2S)]
method: RPBEPBE
basis: SDD
operation: Freq
keyword: #p
keyword: freq=noraman
keyword: PBEPBE/SDD
title: #p freq=noraman PBEPBE/SDD
converged: YES YES NO NO
title: Mulliken charges:
elementType: Cl S O O C C C C C C C C C C C C C C C C C C C C H H H H H H H H H H H H H H H
charge: -0.061919 0.230613 -0.120593 -0.237878 -0.373824 0.536835 -0.723740 -0.412447 0.215171 0.176889 0.422996 -0.300810 -0.477025 -0.400312 -0.406218 -0.442635 -0.253361 -0.245443 0.361759 -0.316962 -0.358281 -0.207190 -0.183543 -0.117555 0.240097 0.262534 0.290855 0.245420 0.242058 0.215905 0.232712 0.237075 0.241787 0.227356 0.230524 0.249526 0.267172 0.253576 0.258877
chargesum: 0.00000
title: Mulliken charges with hydrogens summed into heavy atoms:
elementType: Cl S O O C C C C C C C C C C C C C C C C C C C C
charge: -0.061919 0.230613 -0.120593 -0.237878 -0.133727 0.536835 -0.170351 -0.412447 0.215171 0.176889 0.422996 -0.055390 -0.234966 -0.184407 0.063568 -0.200848 -0.026006 -0.014919 0.361759 -0.067435 -0.091109 0.046387 0.075334 -0.117555
polarizability: 3.32472492e+02 1.07909335e+00 2.61330578e+02 -2.99794657e+01 -1.15374466e+01 1.64107565e+02
1716.lowfreq: -3.5724 0.0019 0.0022 0.0025 2.6588 5.3888 10.6677 25.9812 29.4005
frequency: 10.3169 25.9137 29.3842 41.6206 56.6494 72.4853 98.2680 118.7960 132.0567 144.3325 185.1459 187.7172 204.7100 235.3517 255.3407 290.0548 309.1451 316.1170 350.1074 375.6203 415.3902 416.1329 436.7591 460.9203 473.4910 498.9305 510.9099 512.3364 527.4906 580.5904 597.7372 614.0413 623.5006 625.5581 640.7199 670.0793 697.3519 698.4169 752.7313 773.7369 776.6500 800.7969 801.7837 823.6124 827.3040 842.4559 858.1213 866.0054 877.7059 923.6552 930.3993 951.0403 955.5923 957.6862 971.9860 987.2896 989.7969 991.9791 1009.8175 1027.7543 1049.2338 1064.9035 1072.0971 1109.9931 1136.7863 1142.1422 1152.9193 1176.0665 1176.2936 1187.9196 1207.3740 1215.8508 1221.7802 1236.5880 1260.5909 1285.7845 1289.9346 1293.2440 1344.3119 1369.6623 1375.4017 1401.5745 1404.9575 1415.6861 1435.1939 1439.7982 1445.7799 1451.0686 1475.9809 1515.5388 1579.0006 1585.0662 1587.2494 1605.5028 1630.5729 1668.1297 2916.6584 2969.8824 2983.8626 3034.8606 3108.7911 3120.3348 3126.1545 3131.1550 3143.7624 3155.0182 3160.9789 3162.5573 3163.7674 3174.6617 3182.0700
redmass: 8.4008 5.1382 4.9687 6.8775 6.5937 7.8588 9.1648 5.0507 5.2123 4.0366 4.8045 3.7320 5.4561 5.5243 3.9645 5.6168 5.6392 7.0860 10.8238 10.9850 3.1759 3.0688 4.9974 5.4575 4.7418 2.7270 4.1607 5.0718 3.7197 4.6821 3.9520 6.9083 6.7570 5.8066 5.2638 4.9522 4.6157 3.5333 1.2982 4.2780 4.7075 1.3320 3.1269 1.3821 1.5061 3.8126 4.4206 4.9628 1.8107 1.5309 1.7120 1.3807 2.1586 1.5481 1.3946 3.4537 1.3991 3.7777 3.9722 2.3959 2.8981 3.2436 2.5689 1.3153 1.5350 1.5246 1.2719 1.1650 1.1021 1.2205 1.5479 1.2261 4.0209 1.9804 1.5132 1.3958 1.3213 1.4710 1.6259 2.7718 4.4761 3.9385 3.7455 3.7704 3.5613 1.1403 2.0139 1.2098 2.2102 3.9265 8.6131 7.2693 5.9202 6.7183 6.7710 9.4836 1.0557 1.1011 1.0824 1.0580 1.1092 1.0853 1.0887 1.0880 1.0945 1.0877 1.0968 1.0888 1.1001 1.0966 1.0978
irintensity: 0.0104 0.1326 0.3871 0.3407 0.9450 2.5185 0.3311 0.6306 0.2319 6.0315 2.4174 2.9777 3.1588 1.3339 0.5547 1.5358 1.7304 1.8051 3.4375 11.5535 2.6778 1.6231 2.5762 1.1951 3.1455 22.1230 0.3950 0.5207 12.0201 1.0787 4.9065 4.8295 3.1318 3.7409 21.2461 4.8109 10.8874 1.0533 40.9596 4.4938 11.3401 17.4690 4.4109 60.9541 66.1794 11.2845 13.4820 20.6821 17.3626 2.5067 5.7113 0.5666 12.6582 3.5939 2.5247 33.9161 1.9613 62.0651 130.8825 5.4112 9.1858 44.6308 36.8097 14.0062 29.7886 17.8494 1.4143 39.8067 0.8405 1.6281 10.5873 6.6616 288.2225 7.6395 3.1550 13.5824 7.2790 14.1980 21.8758 13.7223 2.3260 6.6916 1.6536 1.0510 5.4509 105.9030 9.2168 25.5532 190.1708 28.1576 0.6382 16.2938 27.5584 26.8327 23.3964 65.0554 78.9116 21.2181 14.7972 32.0488 10.9508 11.2248 0.4275 5.4361 38.0381 13.0728 18.3377 1.7567 28.2886 6.9957 0.6985
temp: 298.150 k
press: 1.00000 atm
elementType: 17 16 8 8 6 6 6 6 6 6 6 6 6 6 6 6 6 6 6 6 6 6 6 6 1 1 1 1 1 1 1 1 1 1 1 1 1 1 1
symmnumber: 1
zpe: 763707.3 jmol-1
zpe.correction: 0.290881 hartree
zpe.thermalcorrener: 0.311469 hartree
zpe.thermalcorrenthalpy: 0.312413 hartree
zpe.thermalcorrgfe: 0.237866 hartree
zpe.sumelectzpe: -1778.016615 hartree
zpe.sumelectthermal: -1777.996026 hartree
zpe.sumelectthermalent: -1777.995082 hartree
zpe.sumelectthermalfe: -1778.069630 hartree
dipole: -1.8661 1.2446 -3.7534
dipole: 4.3725
quadrupole: -161.5921 -149.5691 -151.5037
quadrupole: -7.4916 -2.6427 1.1536
quadrupole: -7.3705 4.6525 2.7180 -7.4916 -2.6427 1.1536
hfenergy: -1778.3074956 hartree
pointgroup: C01 [X(C20H15Cl1O2S1)]
dipole: 0.7379506 -0.2776453 -1.5289704 debye
polarizability: 331.9446878|-5.0611552|255.9074706|31.2564906|24.7795407|170.0584779 unknown
InChI: InChI=1S/C20H15ClO2S/c21-14-6-8-15(9-7-14)23-11-18(22)17-12-24-19-10-5-13-3-1-2-4-16(13)20(17)19/h1-10,17H,11-12H2
charge 0 multiplicity 1
39 atoms
Cl -8.191434 -0.320533 -0.394612
S  2.621723 3.224179 0.233519
O  0.280045 0.65596 1.538771
O  -2.346607 0.619474 0.753343
C  1.143367 1.060218 -0.739444
C  2.519646 0.564958 -0.320123
C  1.245902 2.609727 -0.924108
C  3.350783 1.549753 0.226833
C  2.961476 -0.797282 -0.376792
C  0.050638 0.73867 0.316357
C  4.282028 -1.117273 0.136854
C  4.644489 1.247346 0.742784
C  5.094231 -0.072856 0.692382
C  2.160496 -1.861299 -0.913265
C  -1.348121 0.55238 -0.294677
C  4.74346 -2.472521 0.083962
C  2.638057 -3.173894 -0.94759
C  3.941277 -3.485282 -0.447019
C  -3.68644 0.387318 0.393113
C  -4.134298 0.114586 -0.923046
C  -4.609272 0.444645 1.466737
C  -5.512509 -0.101944 -1.160262
C  -5.979988 0.229987 1.230068
C  -6.414707 -0.041659 -0.085007
H  0.821747 0.623246 -1.706454
H  0.320146 3.148507 -0.665541
H  1.546711 2.854916 -1.955399
H  5.272227 2.037927 1.164894
H  6.087652 -0.326598 1.080631
H  1.158724 -1.642378 -1.300819
H  -1.363684 -0.438918 -0.803774
H  -1.5231 1.329655 -1.070818
H  5.742323 -2.704468 0.472616
H  2.012819 -3.97399 -1.359109
H  4.303116 -4.518388 -0.48041
H  -3.440972 0.067446 -1.767732
H  -4.234498 0.654784 2.472385
H  -5.870189 -0.313198 -2.172058
H  -6.697462 0.271998 2.054312
