program: Gaussian 09
title: 000290261
version: EM64L-G09RevD.01
frameworkgroup: C1[X(C12H19Cl3N3O2P)]
method: RPBEPBE
basis: SDD
operation: Freq
keyword: #p
keyword: freq=noraman
keyword: PBEPBE/SDD
title: #p freq=noraman PBEPBE/SDD
converged: YES YES NO NO
title: Mulliken charges:
elementType: Cl Cl Cl P O O N N N C C C C C C C C C C C C H H H H H H H H H H H H H H H H H H H
charge: -0.014009 -0.057440 -0.063286 1.305448 -0.601393 -0.266025 -0.531915 -0.702920 -0.380233 -0.311216 -0.300552 -0.784349 -0.562495 -0.560525 0.466644 -0.441131 -0.340834 -0.321818 -0.340853 0.317141 -0.537612 0.245191 0.250038 0.281631 0.230631 0.326898 0.308741 0.335238 0.269236 0.281578 0.252651 0.297580 0.302836 0.222314 0.245255 0.241758 0.253995 0.246451 0.218957 0.218394
chargesum: 0.00000
title: Mulliken charges with hydrogens summed into heavy atoms:
elementType: Cl Cl Cl P O O N N N C C C C C C C C C C C C
charge: -0.014009 -0.057440 -0.063286 1.305448 -0.601393 -0.266025 -0.531915 -0.367682 -0.077397 0.184013 0.211710 -0.148711 -0.011680 -0.010295 0.466644 -0.218817 -0.095578 -0.080060 -0.086858 0.317141 0.146190
polarizability: 3.05125052e+02 -1.34018184e+01 2.03097924e+02 -1.35271309e+00 -4.11430291e+00 1.44651261e+02
1716.lowfreq: -6.7369 0.0016 0.0019 0.0030 3.3514 6.7582 9.7015 17.2230 26.1263
frequency: 9.4655 17.0121 25.9853 32.0867 33.9538 55.2377 59.6623 71.3083 76.2921 87.6713 89.9656 101.0059 133.2900 147.9608 157.5909 181.7686 185.3493 211.2386 215.7203 226.0597 239.3123 242.6776 288.8960 299.8849 330.7575 354.7808 361.5356 399.3879 412.0319 421.0193 448.1964 482.1079 496.3530 513.0186 574.8103 585.5991 604.6658 637.7992 664.0934 687.2008 693.6054 712.7923 725.7119 727.3030 772.9682 776.9457 783.9696 798.1257 820.8984 827.0314 829.2242 915.7419 951.3412 952.4988 986.0819 994.0577 996.6065 1015.2808 1032.9035 1045.6077 1062.6752 1104.0332 1112.2885 1114.5613 1120.0259 1148.5294 1155.1714 1174.2356 1205.5118 1215.8965 1219.7087 1231.0756 1252.9548 1257.3177 1288.3497 1292.4415 1293.2145 1332.6588 1346.4808 1356.9438 1367.5094 1376.9200 1391.2106 1423.5272 1436.8079 1448.0254 1454.4108 1463.3337 1466.1924 1470.3582 1473.1130 1483.7528 1504.2189 1595.1713 1633.8443 2953.8657 2999.7754 3023.1680 3039.5135 3056.1922 3066.7572 3072.5025 3076.9276 3089.3831 3118.7533 3123.8121 3149.2358 3154.0141 3154.6166 3163.6437 3175.3703 3176.6334 3411.0275 3480.4134
redmass: 10.2526 8.0105 6.3939 4.7947 12.4392 10.2981 6.2750 5.7825 3.9128 2.2867 2.4489 5.7947 4.9773 5.1082 4.5379 4.7857 3.4324 8.3899 4.3099 3.4990 1.5992 3.1814 3.7063 3.7673 3.8715 3.4430 5.9622 5.7708 3.0455 2.6754 3.8316 5.9830 3.8449 2.3440 4.3285 1.4595 3.7309 6.3285 7.9524 5.5695 5.3120 3.6561 4.5950 4.5990 1.1869 1.2083 3.5375 1.3620 1.7875 3.5607 1.5586 1.3716 1.8230 1.7247 5.1425 3.2471 1.4708 6.4241 2.4343 2.4205 2.6469 1.4049 1.2597 1.4380 1.1878 3.0688 1.3667 1.1790 2.3795 1.1615 3.1993 1.6091 1.1633 1.1815 1.2923 2.4042 1.4333 1.2216 1.2293 2.0752 1.2471 1.6407 1.0734 3.7962 1.1701 1.0810 1.0923 1.0860 1.0504 1.0801 1.0731 1.4611 2.5379 5.6525 6.5610 1.0333 1.0633 1.0607 1.1038 1.0567 1.0627 1.0935 1.0550 1.1041 1.0893 1.0987 1.1122 1.1106 1.0880 1.0935 1.0962 1.1114 1.0764 1.0767
irintensity: 0.1223 0.2207 0.2920 1.4079 0.8185 1.3371 5.9416 0.7318 9.0637 0.3765 0.6230 0.6151 2.0683 1.3120 5.4433 1.3072 7.0453 0.2774 1.2042 4.0295 1.2379 5.6421 12.2873 24.4507 24.9946 24.6487 5.1405 12.5775 0.0182 161.4542 43.9608 2.5998 40.3527 8.6403 50.5556 50.9888 30.9547 8.5043 13.0086 101.3085 51.2364 3.4720 4.7468 122.1570 2.5514 20.3342 81.0934 36.9037 17.3420 10.7410 60.8141 0.3747 58.3931 46.6008 21.7917 47.8636 1.3281 99.6800 8.3370 17.0178 20.1120 14.3535 0.1723 17.7264 49.9289 24.6706 2.1292 19.0264 92.4133 10.5144 217.5982 10.2159 8.4571 11.9439 0.7101 7.1919 3.1698 10.4420 0.9166 20.4592 1.4302 15.6994 4.9651 9.7389 14.9577 12.4561 2.3837 23.6734 13.4407 11.5863 72.5415 15.2346 313.1797 1.7804 2.6674 80.3581 17.5931 11.9190 52.4597 17.8271 8.5810 8.2785 5.6387 1.4247 22.3220 19.4478 7.3395 17.6091 6.1285 15.7983 4.0282 0.3699 17.5848 22.3773
temp: 298.150 k
press: 1.00000 atm
elementType: 17 17 17 15 8 8 7 7 7 6 6 6 6 6 6 6 6 6 6 6 6 1 1 1 1 1 1 1 1 1 1 1 1 1 1 1 1 1 1 1
symmnumber: 1
zpe: 803169.9 jmol-1
zpe.correction: 0.305911 hartree
zpe.thermalcorrener: 0.330800 hartree
zpe.thermalcorrenthalpy: 0.331744 hartree
zpe.thermalcorrgfe: 0.245509 hartree
zpe.sumelectzpe: -2503.088420 hartree
zpe.sumelectthermal: -2503.063531 hartree
zpe.sumelectthermalent: -2503.062587 hartree
zpe.sumelectthermalfe: -2503.148823 hartree
dipole: -6.0273 -1.4688 -1.4529
dipole: 6.3716
quadrupole: -153.6336 -165.8137 -156.4349
quadrupole: 22.0365 -0.6139 4.3258
quadrupole: 4.9938 -7.1863 2.1925 22.0365 -0.6139 4.3258
hfenergy: -2503.3943316 hartree
pointgroup: C01 [X(C12H19Cl3N3O2P1)]
dipole: -2.4748172 -0.3886762 -0.0898305 debye
polarizability: 297.7293748|-32.4013469|190.3120321|-3.5675391|-27.5165598|164.83283 unknown
InChI: InChI=1S/C12H19Cl3N3O2P/c1-20-12-4-2-11(3-5-12)16-17-21(19,10-15)18(8-6-13)9-7-14/h2-5,16-17H,6-10H2,1H3
charge 0 multiplicity 1
40 atoms
Cl 2.287487 1.347114 2.765392
Cl 2.067254 3.259842 -2.259503
Cl 6.405848 -2.156365 -1.192788
P  1.73979 -1.053245 0.90606
O  2.506678 -2.219817 1.69092
O  -5.347573 1.674986 -0.714629
N  2.79692 -0.323894 -0.285795
N  0.321834 -1.450901 -0.070929
N  -0.903967 -1.596495 0.592224
C  2.34232 0.656557 -1.292321
C  4.242048 -0.65873 -0.22457
C  0.957975 0.238244 2.059981
C  2.629732 2.108962 -0.866439
C  4.535017 -1.899637 -1.082553
C  -2.02519 -0.790638 0.240146
C  -3.294106 -1.107909 0.785651
C  -1.904943 0.338404 -0.612855
C  -4.425341 -0.314713 0.493877
C  -3.030208 1.130542 -0.90443
C  -4.295733 0.813176 -0.354041
C  -6.671253 1.384649 -0.162777
H  2.84916 0.454809 -2.255246
H  1.259702 0.529416 -1.464212
H  4.541619 -0.858467 0.818027
H  4.827005 0.20501 -0.588488
H  0.481909 -0.277065 2.903808
H  0.240455 0.866928 1.516078
H  0.462296 -1.980586 -0.943222
H  3.70226 2.308683 -0.728139
H  2.067589 2.415274 0.02658
H  4.189198 -1.785541 -2.121489
H  4.129996 -2.810696 -0.619115
H  -1.096832 -2.513975 1.006089
H  -3.404213 -1.97663 1.447064
H  -0.935341 0.582945 -1.055378
H  -5.390604 -0.586935 0.930862
H  -2.948148 2.001198 -1.562185
H  -7.32859 2.170984 -0.561892
H  -6.66691 1.430078 0.944325
H  -7.038138 0.391738 -0.490587
