program: Gaussian 09
title: 000290256
version: EM64L-G09RevD.01
frameworkgroup: C1[X(C10H20N2O)]
method: RPBEPBE
basis: SDD
operation: Freq
keyword: #p
keyword: freq=noraman
keyword: PBEPBE/SDD
title: #p freq=noraman PBEPBE/SDD
converged: YES YES NO YES
title: Mulliken charges:
elementType: O N N C C C C C C C C C C H H H H H H H H H H H H H H H H H H H H
charge: -0.233489 -0.256412 -0.256443 0.354149 0.354165 -0.240962 -0.241016 -0.535936 -0.535966 -0.727996 -0.734137 -0.727963 -0.734003 0.237779 0.237764 0.218838 0.226027 0.218826 0.226045 0.269825 0.269847 0.210044 0.203918 0.237300 0.200211 0.246752 0.207377 0.203926 0.210031 0.237229 0.207397 0.246692 0.200180
chargesum: 0.00000
title: Mulliken charges with hydrogens summed into heavy atoms:
elementType: O N N C C C C C C C C C C
charge: -0.233489 0.013413 0.013404 0.354149 0.354165 -0.003183 -0.003252 -0.091071 -0.091095 -0.076734 -0.079796 -0.076777 -0.079733
polarizability: 1.34649175e+02 1.15870991e-01 1.12625132e+02 2.43033945e-04 -1.07474190e-03 1.07179574e+02
1716.lowfreq: -23.1523 -0.0008 -0.0003 0.0002 21.2360 31.6037 68.7036 126.4102 174.6728
frequency: 68.4984 126.2755 174.6571 177.2848 191.3496 233.5192 238.3871 244.0587 253.7544 307.4794 312.5863 344.5294 344.9890 354.4268 391.2557 428.3812 449.8656 467.9700 479.9178 502.6154 551.3530 615.8359 635.9787 654.1301 676.4620 786.5044 792.5854 852.9082 853.5058 859.3510 894.3979 909.4688 917.3412 937.5202 937.6887 950.7522 986.0746 1004.8909 1014.9324 1016.8948 1045.0051 1143.7428 1146.0155 1166.1684 1174.9003 1194.6741 1200.7308 1210.1473 1251.2758 1269.1761 1278.6224 1297.3929 1305.1314 1328.4496 1344.9794 1357.8672 1367.7186 1370.8581 1373.0408 1390.8701 1394.9835 1449.9943 1454.5501 1458.1278 1464.5597 1464.7930 1470.2043 1471.2147 1474.0553 1476.2837 1492.5796 1492.9015 1495.7321 2968.2901 2968.4537 2972.1289 2972.6124 2990.1775 2995.9055 3033.1435 3036.4661 3036.9480 3051.5268 3055.2341 3056.0473 3063.6154 3063.8333 3083.9775 3084.1158 3086.9846 3087.2581 3469.0151 3469.4835
redmass: 3.2361 2.6516 1.0809 1.0412 2.3001 3.2936 1.1494 1.0641 2.3159 2.3779 1.8729 2.6878 2.6485 2.3391 2.7973 5.1101 2.7126 2.6775 5.1145 2.0920 2.6812 2.2228 3.0586 1.9899 3.4484 4.2224 3.3615 5.5923 2.5419 2.4287 2.4876 2.1191 1.9053 1.3857 1.4016 1.8002 1.7081 1.5199 1.7304 1.6499 1.9816 2.8173 5.7620 2.5197 1.5466 2.2199 2.6810 2.8144 2.9135 1.3989 1.7302 1.4453 1.2558 1.2909 1.3166 1.3078 1.2888 1.2054 1.2322 1.2023 1.2377 1.0672 1.0562 1.1163 1.1693 1.1040 1.0654 1.0568 1.0573 1.0776 1.0676 1.0670 1.0826 1.0361 1.0361 1.0364 1.0363 1.0596 1.0613 1.0876 1.0904 1.1050 1.1010 1.0991 1.0990 1.0985 1.0985 1.0988 1.0988 1.0982 1.0982 1.0751 1.0752
irintensity: 0.0220 0.1879 0.1348 0.1591 0.3956 0.0293 0.2466 0.0400 4.0181 0.2013 12.5710 1.6049 1.5720 14.1655 0.0970 9.1090 0.5183 51.0082 11.3366 3.7129 25.4508 189.3443 11.5626 7.8208 9.9343 122.6868 12.3307 44.3697 15.6228 23.4585 1.9349 31.8210 11.8479 0.4813 4.3835 9.4867 2.5808 11.7068 1.7446 11.3484 0.0010 98.8883 24.0201 44.5283 3.1331 0.4930 0.0022 0.0846 13.3481 0.7543 0.1853 0.0900 1.7535 0.0452 0.2002 3.7183 11.7979 15.2056 19.7123 52.9556 0.0814 6.9256 3.0993 9.4487 2.7473 7.1800 0.5886 13.7676 1.4304 6.9453 3.9965 23.9018 37.9547 23.9680 27.3236 83.9670 5.5594 24.6501 71.7430 45.7257 7.4266 53.1148 12.3670 10.4714 27.9013 44.6776 87.9884 19.1470 24.4214 64.1253 5.1523 1.3652 0.4475
temp: 298.150 k
press: 1.00000 atm
elementType: 8 7 7 6 6 6 6 6 6 6 6 6 6 1 1 1 1 1 1 1 1 1 1 1 1 1 1 1 1 1 1 1 1
symmnumber: 1
zpe: 770169.8 jmol-1
zpe.correction: 0.293342 hartree
zpe.thermalcorrener: 0.306788 hartree
zpe.thermalcorrenthalpy: 0.307732 hartree
zpe.thermalcorrgfe: 0.255677 hartree
zpe.sumelectzpe: -576.707574 hartree
zpe.sumelectthermal: -576.694128 hartree
zpe.sumelectthermalent: -576.693184 hartree
zpe.sumelectthermalfe: -576.745239 hartree
dipole: 0.0000 -0.0024 0.4192
dipole: 0.4192
quadrupole: -78.5336 -78.2623 -85.5099
quadrupole: 3.0577 0.0000 0.0007
quadrupole: 2.2350 2.5063 -4.7413 3.0577 0.0000 0.0007
hfenergy: -577.0009163 hartree
pointgroup: C01 [X(C10H20N2O1)]
dipole: 0.0000273 -0.0001594 0.1649357 debye
polarizability: 134.6442226|0.3498937|112.6299433|-0.0069618|-0.027645|107.1797152 unknown
InChI: InChI=1S/C10H20N2O/c1-9(2)5-11-8-10(3,4)6-12-7(9)13-8/h7-8,11-12H,5-6H2,1-4H3
charge 0 multiplicity 1
33 atoms
O  -0.000279 -0.006466 -1.47413
N  -0.008151 1.774315 0.217947
N  0.008524 -1.771927 0.234395
C  -1.853219 -0.00454 0.20709
C  1.853699 0.006246 0.20617
C  -0.838052 0.884132 -0.590946
C  0.837876 -0.889361 -0.58332
C  1.085335 1.125119 0.988311
C  -1.084517 -1.11586 0.999368
C  -2.807287 -0.670941 -0.819283
C  -2.667011 0.864345 1.191304
C  2.807993 0.662617 -0.826306
C  2.667081 -0.853796 1.198466
H  -1.401535 1.505369 -1.310059
H  1.400658 -1.517294 -1.29717
H  0.679196 0.709595 1.927578
H  1.803964 1.913025 1.283515
H  -0.6782 -0.691645 1.934733
H  -1.802979 -1.901028 1.302189
H  0.341329 2.556384 -0.347495
H  -0.340895 -2.55964 -0.323133
H  -3.365489 0.09277 -1.393631
H  -3.547543 -1.308888 -0.30001
H  -2.246533 -1.287974 -1.543048
H  -3.362059 0.235381 1.781076
H  -2.001152 1.410244 1.88142
H  -3.271557 1.615695 0.648493
H  3.548924 1.304416 -0.312806
H  3.365386 -0.106735 -1.393834
H  2.247591 1.273643 -1.555396
H  3.270108 -1.611404 0.662754
H  2.001019 -1.391856 1.894515
H  3.363375 -0.219841 1.781343
