program: Gaussian 09
title: 000290255
version: EM64L-G09RevD.01
frameworkgroup: C1[X(C11H23NO2)]
method: RPBEPBE
basis: SDD
operation: Freq
keyword: #p
keyword: freq=noraman
keyword: PBEPBE/SDD
title: #p freq=noraman PBEPBE/SDD
converged: NO YES NO NO
title: Mulliken charges:
elementType: O O N C C C C C C C C C C C H H H H H H H H H H H H H H H H H H H H H H H
charge: -0.250192 -0.304055 -0.065330 0.289275 0.008895 -0.458359 -0.745406 -0.727572 -0.289708 0.349400 -0.622854 -0.693619 -0.706556 -0.750303 0.177496 0.183385 0.230068 0.197645 0.245989 0.207579 0.255936 0.189978 0.233905 0.161175 0.228852 0.189302 0.223535 0.233224 0.261530 0.190282 0.221901 0.218405 0.232002 0.198430 0.219122 0.222429 0.244215
chargesum: 0.00000
title: Mulliken charges with hydrogens summed into heavy atoms:
elementType: O O N C C C C C C C C C C C
charge: -0.250192 -0.304055 -0.065330 0.289275 0.186391 -0.044907 -0.094193 -0.047753 0.100320 0.349400 0.023207 -0.019906 -0.057719 -0.064538
polarizability: 1.56931664e+02 -2.99688974e+00 1.29714106e+02 -7.12263656e-01 -6.37049109e-01 1.14702182e+02
1716.lowfreq: -20.8776 -0.0003 0.0006 0.0007 3.4496 8.8890 38.1109 64.5879 93.5746
frequency: 37.7154 64.4521 93.5523 125.8417 138.8869 161.5129 180.1334 207.3966 213.2107 220.8558 234.5509 242.9017 255.5782 257.9223 273.5025 289.1868 310.1488 331.1176 368.8660 374.2043 392.5174 415.2167 431.9560 443.0000 486.6932 539.2240 548.4063 618.9529 741.9184 796.5517 831.2910 846.0878 868.4747 908.0019 915.3795 924.7662 929.8320 943.4722 950.4655 981.8527 987.7440 1014.7661 1026.7529 1028.8803 1031.8198 1054.1657 1102.8345 1111.8765 1137.9321 1176.7375 1185.7068 1197.1300 1220.2269 1241.7529 1249.4019 1261.7980 1272.0405 1303.5048 1322.6280 1342.8543 1350.9169 1370.2789 1373.0991 1374.3830 1379.3106 1392.7384 1397.9435 1431.6566 1445.6349 1452.5885 1458.3937 1462.7849 1464.2669 1466.9653 1468.5098 1470.3591 1473.0643 1476.3930 1479.9305 1484.5050 1491.2147 1497.8327 2755.7233 2808.8069 2858.5593 2865.4037 2969.6507 2980.8282 2984.2018 2987.1917 2990.1862 3017.9787 3027.5237 3057.1167 3065.5800 3077.1450 3077.6218 3080.5062 3082.5903 3085.3389 3090.5230 3094.1946 3096.0679 3112.1576 3116.2201
redmass: 2.8624 3.3695 3.4849 2.7532 2.7716 1.0760 1.0218 1.4207 1.4002 1.5700 1.4867 1.6584 2.2477 2.2258 1.1384 2.4707 2.4327 2.5310 2.5696 1.9887 2.2299 2.8882 2.6543 2.8497 3.9799 2.9581 4.7793 4.8296 4.2632 3.2988 3.5268 3.7960 4.2293 1.6142 1.6074 2.2415 1.7482 1.4002 1.2112 3.6310 2.5472 1.3980 1.4074 1.4736 1.7822 1.8645 4.2093 1.3635 1.9830 2.3639 2.0312 1.5690 2.4404 2.5610 3.0312 2.6075 2.3564 1.5781 1.3266 1.3197 1.3880 1.2218 1.2455 1.2296 1.2299 1.2218 1.2145 1.1552 1.0487 1.0650 1.0692 1.0580 1.0523 1.0493 1.0525 1.0638 1.0884 1.0573 1.0546 1.0545 1.0648 1.0537 1.0694 1.0699 1.0591 1.0795 1.0373 1.0354 1.0363 1.0378 1.0361 1.0725 1.0879 1.0979 1.0900 1.0991 1.1006 1.0986 1.0968 1.1003 1.0995 1.0981 1.0995 1.0999 1.0993
irintensity: 0.1023 2.8154 0.8777 2.2685 1.9790 0.0409 0.1055 0.1420 0.5509 0.6692 0.3966 0.1181 0.6284 0.5581 0.0877 2.6507 1.1665 4.3302 1.2649 5.6966 2.2143 2.1269 0.9637 5.0116 2.1802 1.4862 2.2809 4.4879 5.1346 2.7026 35.3091 21.6322 66.8023 3.5150 1.3400 26.5167 0.0941 3.5472 0.0802 160.6705 66.9224 7.4197 0.6026 3.1666 55.9205 18.2488 230.5971 5.6824 5.3564 26.5849 67.9816 13.4980 12.3116 22.3727 22.3366 20.6538 8.8984 2.7812 7.2011 14.9258 2.3494 9.5625 44.0671 30.9302 16.4497 30.5503 21.3167 4.6363 0.8689 3.3245 10.7879 10.4319 2.2607 0.2536 6.7584 3.0054 12.0461 11.2903 7.3193 7.6198 28.2192 26.2272 111.7488 70.7820 118.2807 155.1541 36.7161 27.1404 19.0021 31.8162 29.9651 44.4349 27.6112 48.8673 27.5887 8.3127 32.2959 18.3957 25.3631 21.4105 70.0254 23.4982 42.4400 14.2462 16.0730
temp: 298.150 k
press: 1.00000 atm
elementType: 8 8 7 6 6 6 6 6 6 6 6 6 6 6 1 1 1 1 1 1 1 1 1 1 1 1 1 1 1 1 1 1 1 1 1 1 1
symmnumber: 1
zpe: 855988.1 jmol-1
zpe.correction: 0.326029 hartree
zpe.thermalcorrener: 0.342974 hartree
zpe.thermalcorrenthalpy: 0.343918 hartree
zpe.thermalcorrgfe: 0.283360 hartree
zpe.sumelectzpe: -636.970421 hartree
zpe.sumelectthermal: -636.953476 hartree
zpe.sumelectthermalent: -636.952532 hartree
zpe.sumelectthermalfe: -637.013089 hartree
dipole: 0.8119 -0.6320 -2.4229
dipole: 2.6323
quadrupole: -78.9348 -87.0582 -90.4056
quadrupole: -0.0445 -1.1091 1.0445
quadrupole: 6.5314 -1.5920 -4.9394 -0.0445 -1.1091 1.0445
hfenergy: -637.2964499 hartree
pointgroup: C01 [X(C11H23N1O2)]
dipole: -0.2926154 0.1280239 -0.985148 debye
polarizability: 156.8787745|-2.6455766|129.6026738|2.274731|-1.2673607|114.8665033 unknown
InChI: InChI=1S/C11H23NO2/c1-10(2,3)14-9-11(4,5)7-12(6)8-13-9/h9H,7-8H2,1-6H3
charge 0 multiplicity 1
37 atoms
O  -0.302215 1.240136 0.227378
O  1.363828 -0.457414 0.289031
N  -2.63862 0.677329 -0.00547
C  -0.945421 -1.17824 0.112251
C  0.110077 -0.104397 -0.27593
C  -2.305125 -0.687693 -0.470942
C  -0.5702 -2.523621 -0.552883
C  -1.035123 -1.330389 1.64764
C  -1.574661 1.622967 -0.376235
C  2.592861 0.363983 -0.034045
C  -3.980869 1.132655 -0.406628
C  2.685548 1.514172 0.992232
C  3.7375 -0.648421 0.160717
C  2.562881 0.897813 -1.481564
H  0.158993 -0.022617 -1.391412
H  -2.258011 -0.734274 -1.593883
H  -3.105478 -1.377963 -0.14605
H  -0.464945 -2.421588 -1.651066
H  0.386913 -2.895704 -0.150087
H  -1.350776 -3.282477 -0.355835
H  -1.365475 -0.385044 2.10743
H  -1.762574 -2.122633 1.907886
H  -0.050759 -1.602836 2.063901
H  -1.439527 1.673486 -1.496243
H  -1.815415 2.626821 0.010624
H  -4.123087 1.195611 -1.515571
H  -4.178861 2.132301 0.021394
H  -4.739183 0.435846 -0.007969
H  1.81868 2.186183 0.893153
H  3.618603 2.089774 0.841529
H  2.686834 1.103252 2.016917
H  3.678023 -1.456067 -0.589948
H  3.669321 -1.102846 1.164181
H  4.717647 -0.14664 0.067884
H  2.44035 0.075964 -2.210597
H  3.520907 1.403785 -1.698437
H  1.753062 1.634487 -1.624554
