program: Gaussian 09
title: 000290251
version: EM64L-G09RevD.01
frameworkgroup: C1[X(C20H29N3)]
method: RPBEPBE
basis: SDD
operation: Freq
keyword: #pfreq=noraman
keyword: PBEPBE/SDD
title: #p freq=noraman PBEPBE/SDD
converged: YES YES NO NO
title: Mulliken charges:
elementType: N N N C C C C C C C C C C C C C C C C C C C C H H H H H H H H H H H H H H H H H H H H H H H H H H H H H
charge: -0.137259 -0.010690 -0.010692 0.184986 0.185033 -0.409412 -0.409194 0.285013 0.039167 0.039117 -0.733023 -0.733044 -0.733349 -0.733038 -0.709901 -0.727937 -0.726287 0.030707 0.030677 -0.339589 -0.339579 -0.220308 -0.220307 0.197097 0.187869 0.187864 0.197312 0.232301 0.211082 0.231910 0.256717 0.210915 0.196342 0.211082 0.232330 0.231965 0.210921 0.256700 0.196351 0.224537 0.211095 0.224597 0.235786 0.207013 0.211655 0.235363 0.211252 0.206918 0.258552 0.258550 0.232416 0.232415
chargesum: 0.00000
title: Mulliken charges with hydrogens summed into heavy atoms:
elementType: N N N C C C C C C C C C C C C C C C C C C C C
charge: -0.137259 -0.010690 -0.010692 0.184986 0.185033 -0.024446 -0.024019 0.285013 0.039167 0.039117 -0.057730 -0.069069 -0.057971 -0.069067 -0.049672 -0.073482 -0.072754 0.030707 0.030677 -0.081037 -0.081030 0.012108 0.012109
polarizability: 3.49529896e+02 3.23717004e-03 2.30704744e+02 2.86126962e+00 1.37663519e-03 1.55407306e+02
1716.lowfreq: -49.6757 -18.7227 -12.0823 -0.0008 -0.0008 -0.0002 7.0302 11.9879 29.3959
frequency: -48.9805 -17.4492 29.2762 83.8325 91.6902 100.7086 128.1583 155.0683 172.2560 173.8736 192.7423 198.8817 206.1514 225.5994 226.0049 235.3277 246.1344 246.5218 260.9127 284.8260 301.7335 303.0821 314.8760 324.1473 348.6131 369.4774 378.1376 400.6048 427.7589 433.4644 445.7903 469.7794 483.8437 486.4705 504.5681 532.8938 536.7887 560.1146 561.1354 606.5529 607.2383 623.6073 656.3384 739.1209 750.0997 774.5036 785.2003 814.2163 816.3587 820.9809 849.5849 884.1327 885.4154 893.3537 898.9453 914.7734 920.6359 934.8139 936.3000 937.3110 958.6382 969.2038 993.9666 996.0989 1006.4106 1006.8232 1009.1231 1012.4382 1019.4538 1024.1800 1064.2455 1115.0747 1119.6987 1142.7965 1151.4919 1151.8680 1167.9111 1194.1153 1200.9352 1201.9730 1212.0918 1226.8757 1235.8405 1254.0575 1258.3047 1271.9025 1283.8657 1308.4280 1312.4271 1345.8399 1347.0418 1359.3152 1365.8311 1368.9283 1371.9583 1372.6347 1387.0220 1395.1731 1398.6765 1419.4183 1437.2140 1443.9298 1452.2332 1453.2483 1456.3836 1457.5531 1457.9963 1463.2737 1464.4645 1466.2936 1470.7236 1475.5267 1478.5297 1483.2012 1487.2516 1487.9148 1491.2224 1505.8846 1508.6617 1549.4603 1613.6368 2854.4377 2856.0049 2968.8488 2977.5362 2978.5047 2979.9987 2981.2427 2982.7882 2987.7185 3060.3648 3062.8492 3064.9299 3065.8667 3066.3628 3069.2632 3071.6480 3074.8524 3077.7613 3082.9222 3087.6039 3093.0998 3096.9317 3102.1392 3124.0412 3124.2214 3131.5875 3144.9910 3159.6096 3170.1188
redmass: 2.0242 4.2230 3.9751 2.7488 3.3151 3.7754 1.7297 1.5652 1.8829 1.7123 2.0352 2.8873 1.2451 2.2287 1.4228 1.3805 1.0957 1.0572 2.2438 2.4261 3.0103 3.5342 2.4473 2.0919 3.3121 2.7545 3.4702 2.4363 3.0693 2.3841 2.5094 3.1720 3.3250 3.5458 2.0182 3.2842 3.3693 3.6241 5.3013 8.0055 4.8926 4.9774 4.7121 4.0385 4.6952 1.2953 5.2451 2.9876 4.1304 2.7608 2.9502 4.7296 1.7971 1.8629 1.8498 1.7959 1.5892 1.4505 1.2885 1.4670 1.8090 1.3607 1.8227 1.3211 1.6429 1.9603 1.4733 1.3787 1.4083 2.0888 2.0787 1.6972 2.8907 2.4359 3.5530 2.0152 1.5171 2.8959 2.4479 3.0684 3.0792 3.0105 2.2795 5.5734 3.7242 4.3830 1.5340 1.8496 4.0832 1.2973 1.2308 1.1891 1.1957 1.1843 1.2158 1.2576 1.2164 1.2245 1.3055 5.9744 2.2876 1.1381 1.0655 1.0525 1.0547 3.0520 1.0573 1.0508 1.0690 1.0729 1.0549 1.0549 1.0552 1.0557 1.1059 1.0685 1.0626 1.0613 7.3180 6.9052 6.4834 1.0736 1.0699 1.0345 1.0361 1.0371 1.0377 1.0371 1.0350 1.0360 1.0919 1.0959 1.1002 1.0974 1.0996 1.0933 1.0987 1.0970 1.0942 1.0953 1.1001 1.0995 1.1004 1.0983 1.0961 1.0960 1.0856 1.0892 1.0958 1.1006
irintensity: 0.0771 0.0123 0.1147 0.1234 0.1438 2.7114 0.5253 0.2240 0.0837 0.4584 0.0923 0.4426 0.5234 0.8794 0.2136 0.0092 0.0395 0.0148 1.1308 0.1520 0.3417 1.3566 0.3583 0.1745 1.0692 0.0817 6.6865 0.0060 1.2717 2.1132 0.7740 0.7646 0.5386 0.9892 4.8543 3.5359 0.0016 0.0059 5.6353 6.3058 0.3730 0.5068 0.8142 1.7694 0.0491 99.1388 6.8284 0.7250 0.0873 7.1480 2.7843 0.4030 0.0303 4.3795 2.3781 0.8180 4.7651 1.5811 0.0004 3.3422 1.6600 2.5667 34.0210 0.0000 5.4057 20.9210 24.3003 2.1883 1.7044 21.2336 68.7901 14.1161 64.5655 0.6079 17.2976 17.1331 33.4004 0.0492 68.1342 5.7288 25.1074 44.8109 0.0801 6.8391 14.2556 0.8748 14.6614 3.2311 51.7108 0.4341 0.3376 0.0895 15.8810 45.6280 33.8194 10.2353 42.3877 26.6577 7.0963 1.6567 0.3999 0.1654 4.4015 0.1628 7.4381 15.4735 2.7157 1.9889 0.2806 7.4418 16.7994 0.1975 2.5807 8.4915 6.6861 22.6167 15.7452 47.6333 13.4953 15.0335 0.4959 11.8604 127.1606 29.3502 0.5722 51.7187 57.2130 27.1763 34.1198 18.0188 0.0095 17.9614 15.0868 5.0293 4.0139 56.0410 0.8405 150.6542 86.0583 35.5724 12.5594 61.3209 29.4938 9.8341 4.3091 26.4995 1.8881 6.7810 17.9126 34.5753
temp: 298.150 k
press: 1.00000 atm
elementType: 7 7 7 6 6 6 6 6 6 6 6 6 6 6 6 6 6 6 6 6 6 6 6 1 1 1 1 1 1 1 1 1 1 1 1 1 1 1 1 1 1 1 1 1 1 1 1 1 1 1 1 1
symmnumber: 1
zpe: 1172912.5 jmol-1
zpe.correction: 0.446739 hartree
zpe.thermalcorrener: 0.468461 hartree
zpe.thermalcorrenthalpy: 0.469406 hartree
zpe.thermalcorrgfe: 0.399313 hartree
zpe.sumelectzpe: -942.020805 hartree
zpe.sumelectthermal: -941.999082 hartree
zpe.sumelectthermalent: -941.998138 hartree
zpe.sumelectthermalfe: -942.068230 hartree
dipole: 1.0294 0.0011 -0.2977
dipole: 1.0716
quadrupole: -121.5364 -140.1353 -143.8942
quadrupole: 0.0063 -0.9823 0.0003
quadrupole: 13.6522 -4.9467 -8.7055 0.0063 -0.9823 0.0003
hfenergy: -942.4675436 hartree
pointgroup: C01 [X(C20H29N3)]
dipole: 0.4018154 0.0004815 -0.1276258 debye
polarizability: 349.5472043|0.0560873|230.7046934|-2.195759|-0.0770068|155.3900475 unknown
InChI: InChI=1S/C20H29N3/c1-18(2,3)23-12-19(4,5)16-17(20(6,7)13-23)22-15-11-9-8-10-14(15)21-16/h8-11H,12-13H2,1-7H3
charge 0 multiplicity 1
52 atoms
N  2.617421 0.001557 -0.178842
N  -1.707141 -1.405657 -0.001812
N  -1.708588 1.404393 -0.004506
C  0.69317 -1.696688 0.008819
C  0.69139 1.698047 0.005148
C  1.97556 -1.205708 -0.728248
C  1.974424 1.207028 -0.730855
C  4.136041 0.00177 -0.162631
C  -0.52806 -0.738618 -0.047216
C  -0.528811 0.738495 -0.048719
C  1.007755 -1.961644 1.511794
C  0.323037 -3.052043 -0.663158
C  1.00576 1.966618 1.507537
C  0.319628 3.051503 -0.66974
C  4.733741 -0.004988 -1.603701
C  4.647839 1.250476 0.607535
C  4.647453 -1.239666 0.619475
C  -2.903647 -0.720542 0.034192
C  -2.904381 0.718116 0.032881
C  -4.142707 -1.432081 0.078722
C  -4.14417 1.428463 0.076189
C  -5.344728 -0.719651 0.120632
C  -5.34546 0.714877 0.119376
H  2.681618 -2.050436 -0.681606
H  1.718138 -1.067983 -1.809076
H  1.717303 1.066902 -1.811448
H  2.67946 2.052641 -0.685645
H  0.102345 -2.316732 2.035235
H  1.789002 -2.740488 1.597704
H  1.38299 -1.051091 2.007416
H  -0.554194 -3.504604 -0.179541
H  0.080023 -2.913899 -1.733419
H  1.180185 -3.747697 -0.585878
H  1.785869 2.746801 1.59171
H  0.099914 2.321482 2.030368
H  1.3824 1.057639 2.004982
H  0.076319 2.91066 -1.739579
H  -0.557865 3.504289 -0.18681
H  1.176118 3.748174 -0.594374
H  4.410636 -0.902882 -2.162679
H  5.839325 -0.004639 -1.571285
H  4.410322 0.887493 -2.171122
H  4.14913 1.321107 1.590249
H  4.480262 2.195256 0.061433
H  5.73699 1.161901 0.771124
H  4.15312 -1.297058 1.60526
H  5.737689 -1.152977 0.776853
H  4.473873 -2.190236 0.085451
H  -4.11453 -2.526315 0.078416
H  -4.117115 2.522724 0.07395
H  -6.299188 -1.256467 0.155209
H  -6.300466 1.250781 0.153026
