program: Gaussian 09
title: 000290249
version: EM64L-G09RevD.01
frameworkgroup: C1[X(C14H25NO2)]
method: RPBEPBE
basis: SDD
operation: Freq
keyword: #p
keyword: freq=noraman
keyword: PBEPBE/SDD
title: #p freq=noraman PBEPBE/SDD
converged: YES YES NO NO
title: Mulliken charges:
elementType: O O N C C C C C C C C C C C C C C H H H H H H H H H H H H H H H H H H H H H H H H H
charge: -0.181806 -0.185217 -0.143394 0.210868 0.240873 -0.422421 -0.432996 0.294460 0.097850 0.023463 -0.726935 -0.728302 -0.730027 -0.741425 -0.701874 -0.745456 -0.707476 0.213116 0.209858 0.225227 0.213726 0.230011 0.199038 0.247321 0.250503 0.237349 0.213089 0.243141 0.237881 0.205120 0.231977 0.242055 0.206043 0.222950 0.209114 0.209852 0.208703 0.239346 0.221707 0.217479 0.216056 0.229150
chargesum: 0.00000
title: Mulliken charges with hydrogens summed into heavy atoms:
elementType: O O N C C C C C C C C C C C C C C
charge: -0.181806 -0.185217 -0.143394 0.210868 0.240873 0.000553 0.005957 0.294460 0.097850 0.023463 -0.050565 -0.027360 -0.043884 -0.061350 -0.059957 -0.075701 -0.044790
polarizability: 1.72764323e+02 3.54946834e-01 1.65375641e+02 2.05714748e+00 7.87215373e-01 1.43032152e+02
1716.lowfreq: -16.1006 -10.4788 0.0005 0.0007 0.0007 15.5736 34.4914 51.0598 86.5772
frequency: 33.6951 51.0464 86.5420 93.9767 119.1249 152.1342 168.1025 172.3479 179.9383 205.5761 217.0353 222.2059 231.4294 237.9980 248.9400 259.0459 264.2250 271.7554 286.2674 300.6689 319.8252 325.3455 335.8036 365.1938 381.4633 384.7129 418.1337 432.8914 444.5953 485.8217 512.9555 514.8288 587.4765 633.8254 707.9347 718.5447 758.3901 808.5552 816.4435 845.1217 885.3801 898.8525 904.0902 910.0830 919.8069 932.2922 945.9724 946.7593 956.2779 959.6621 1005.4887 1010.3349 1018.5428 1020.0554 1035.5109 1109.9525 1112.6979 1144.3139 1169.2659 1174.2893 1190.1140 1209.6300 1218.5636 1226.6657 1250.5539 1255.8349 1286.2480 1318.0128 1338.4769 1355.2099 1372.7698 1374.4679 1377.7145 1378.3797 1391.5116 1395.3308 1401.8459 1447.7063 1453.5498 1457.4718 1458.7037 1462.2368 1462.6288 1467.8976 1469.1093 1475.4783 1475.9394 1478.3845 1484.5105 1486.2152 1487.4480 1493.8705 1505.6288 1582.2330 1602.0655 2881.3376 2909.9828 2974.0055 2976.8652 2981.1340 2984.2972 2986.4530 2987.1924 2990.1567 3051.1199 3069.3471 3071.4521 3073.8882 3075.1965 3076.6178 3080.5261 3083.3372 3085.2111 3085.8430 3091.8870 3092.7902 3094.2471 3095.0971 3096.2306 3102.7201
redmass: 4.7503 2.6820 3.8680 5.4845 2.9142 4.5252 1.6392 1.0651 2.3833 1.2646 1.3416 1.3443 1.4294 1.5525 1.1229 2.0045 2.2019 1.4149 2.5843 2.7811 3.4380 4.7010 2.6955 2.5668 2.6017 2.2743 2.6778 2.5533 2.3422 2.2278 2.4673 3.1102 3.9198 3.5409 5.8170 4.5893 5.8360 2.9427 3.2906 2.7298 2.2537 1.7606 2.4177 2.1394 1.5821 2.0505 1.2608 1.3557 1.7105 1.6937 1.3991 1.3723 1.4127 1.4114 1.9269 3.2740 3.4919 2.7466 2.4585 2.1327 2.0991 2.8344 3.1378 3.0414 3.3284 3.7149 1.5749 1.4015 1.3065 1.2882 1.1904 1.1960 1.1853 1.2082 1.2016 1.2189 1.1998 1.0642 1.0581 1.0531 1.0517 1.0520 1.0529 1.0534 1.0663 1.0581 1.0530 1.0552 1.0573 1.0613 1.0572 1.0637 1.0569 10.6269 10.8437 1.0707 1.0708 1.0349 1.0352 1.0359 1.0354 1.0364 1.0359 1.0363 1.0900 1.0997 1.0994 1.0992 1.0972 1.0990 1.0958 1.0988 1.0981 1.0935 1.0994 1.1006 1.0996 1.0998 1.0994 1.0992
irintensity: 1.5712 0.0365 1.7799 2.0533 0.3014 4.0262 0.1637 0.0728 0.1751 0.4861 0.4999 0.7620 0.5266 0.3345 0.1603 2.2044 0.8670 0.9386 2.6478 2.7191 7.2817 1.7007 1.9194 0.3453 1.9512 1.3699 4.5176 0.2923 1.5899 4.5979 0.6369 2.1655 2.4631 2.0903 7.3039 4.2943 0.8667 6.9058 2.2922 7.8748 11.0743 3.0017 22.6882 43.1128 2.5060 24.6261 3.1283 3.0299 13.3345 18.1605 6.7087 11.6560 3.1649 3.4542 24.7623 13.9359 19.3593 11.6121 8.8119 30.4567 40.0480 10.4206 6.8239 24.6212 37.6256 21.2956 1.7955 2.7112 1.6303 6.4646 6.3568 26.9938 41.8089 17.4011 30.3548 10.2033 25.1705 1.2262 3.1808 4.8272 8.4222 7.4795 0.2291 6.5546 2.1909 6.0033 8.6635 2.0158 16.8906 25.1065 1.9966 21.0283 20.2383 119.8207 103.6764 63.5738 37.1298 26.8077 26.1085 16.1188 18.4651 33.7944 26.1862 21.9755 17.3301 18.7857 2.9131 9.6126 39.7587 6.3074 11.3560 69.7066 13.7121 40.7975 43.4902 6.5324 40.4563 37.5456 18.8393 19.4284
temp: 298.150 k
press: 1.00000 atm
elementType: 8 8 7 6 6 6 6 6 6 6 6 6 6 6 6 6 6 1 1 1 1 1 1 1 1 1 1 1 1 1 1 1 1 1 1 1 1 1 1 1 1 1
symmnumber: 1
zpe: 955510.5 jmol-1
zpe.correction: 0.363935 hartree
zpe.thermalcorrener: 0.384043 hartree
zpe.thermalcorrenthalpy: 0.384987 hartree
zpe.thermalcorrgfe: 0.317886 hartree
zpe.sumelectzpe: -752.289267 hartree
zpe.sumelectthermal: -752.269158 hartree
zpe.sumelectthermalent: -752.268214 hartree
zpe.sumelectthermalfe: -752.335315 hartree
dipole: 5.0959 -0.3016 -0.9167
dipole: 5.1864
quadrupole: -115.6934 -99.4070 -110.7611
quadrupole: 0.3160 0.1753 -4.4903
quadrupole: -7.0729 9.2135 -2.1406 0.3160 0.1753 -4.4903
hfenergy: -752.6532015 hartree
pointgroup: C01 [X(C14H25N1O2)]
dipole: -2.0064231 -0.0914492 0.3599136 debye
polarizability: 172.7518155|-0.459008|165.3888698|2.0550742|-0.7871875|143.0314307 unknown
InChI: InChI=1S/C14H25NO2/c1-12(2,3)15-8-13(4,5)10(16)11(17)14(6,7)9-15/h8-9H2,1-7H3
charge 0 multiplicity 1
42 atoms
O  2.393585 0.927015 -1.544822
O  2.638543 -0.690972 1.184102
N  -1.096752 -0.074079 0.065847
C  0.712251 1.75531 0.066995
C  0.863752 -1.744978 -0.174188
C  -0.44513 1.028889 0.83038
C  -0.546636 -1.394541 0.452948
C  -2.61636 -0.021799 -0.035312
C  1.680131 0.718722 -0.528781
C  1.809541 -0.610887 0.234649
C  0.18353 2.668876 -1.060298
C  1.535935 2.592575 1.098405
C  0.735205 -1.839104 -1.716434
C  1.346496 -3.080559 0.433863
C  -3.058835 1.32473 -0.665732
C  -3.114574 -1.142939 -0.990487
C  -3.288529 -0.194692 1.361239
H  -0.04463 0.638268 1.794609
H  -1.182473 1.804363 1.100285
H  -1.222798 -2.19155 0.106506
H  -0.449512 -1.493824 1.561508
H  -0.458151 2.098665 -1.75302
H  -0.405306 3.502134 -0.63336
H  1.02392 3.087183 -1.639335
H  2.012534 1.949439 1.859708
H  2.327017 3.16531 0.584369
H  0.865213 3.308266 1.610645
H  0.227975 -0.949175 -2.126409
H  1.72309 -1.930646 -2.200601
H  0.134846 -2.730773 -1.977542
H  2.303948 -3.390684 -0.020099
H  1.50898 -2.992019 1.521546
H  0.601839 -3.876068 0.24573
H  -2.655008 1.424136 -1.688335
H  -4.161971 1.354838 -0.722914
H  -2.737327 2.204175 -0.082199
H  -3.10776 -2.144888 -0.525646
H  -2.494819 -1.170278 -1.904336
H  -4.158349 -0.934068 -1.285272
H  -3.01433 0.629299 2.045655
H  -4.390097 -0.201637 1.266755
H  -2.982782 -1.147931 1.830278
