program: Gaussian 09
title: 000290247
version: EM64L-G09RevD.01
frameworkgroup: C1[X(C11H15N3O2)]
method: RPBEPBE
basis: SDD
operation: Freq
keyword: #p
keyword: freq=noraman
keyword: PBEPBE/SDD
title: #p freq=noraman PBEPBE/SDD
converged: YES YES NO NO
title: Mulliken charges:
elementType: O O N N N C C C C C C C C C C C H H H H H H H H H H H H H H H
charge: -0.293726 -0.272820 -0.437162 -0.616049 -0.345000 0.453926 0.232020 -0.426853 -0.333447 -0.474125 -0.336577 -0.357549 0.179227 0.120393 -0.256392 -0.667153 0.295563 0.222192 0.262802 0.249024 0.262147 0.267478 0.268777 0.217854 0.232149 0.213527 0.252196 0.224991 0.315350 0.336482 0.210755
chargesum: 0.00000
title: Mulliken charges with hydrogens summed into heavy atoms:
elementType: O O N N N C C C C C C C C C C C
charge: -0.293726 -0.272820 -0.141599 0.035782 -0.134244 0.453926 0.232020 -0.204661 -0.070646 0.037046 -0.069099 -0.088772 0.179227 0.120393 0.193611 0.023562
polarizability: 2.35456252e+02 -2.09123738e-01 1.47967353e+02 -1.32815007e+01 5.81098920e+00 9.51551025e+01
1716.lowfreq: -6.7441 -3.3741 -0.0003 0.0003 0.0007 7.4981 35.7880 39.1269 44.4272
frequency: 35.7811 39.1138 44.4167 61.3756 74.5076 95.0561 119.7475 123.1440 205.6648 229.9625 248.0331 283.1199 308.2545 324.3851 383.7745 415.0844 418.0456 451.1740 461.4879 469.6499 484.9091 514.7178 526.8383 570.7527 610.8260 616.9490 651.7048 679.1716 733.3162 754.2529 788.7582 815.4996 821.7291 831.0579 842.8124 847.6928 852.2066 977.5039 985.8881 990.4021 996.0722 1009.4615 1044.5702 1056.1711 1072.3924 1095.2496 1105.4431 1130.2469 1154.4210 1187.3208 1237.3595 1257.3428 1280.5669 1287.6422 1313.9499 1325.8177 1358.5094 1374.2017 1378.2533 1388.6381 1433.9741 1454.8371 1462.6244 1463.5042 1476.0362 1485.2548 1517.7641 1576.8962 1586.2025 1613.8261 1631.1324 1647.9771 2991.3909 3009.1805 3026.0325 3071.0324 3085.5398 3090.8540 3114.8530 3116.9031 3150.0950 3158.7669 3176.4995 3330.3204 3505.9131 3557.4936 3663.6886
redmass: 3.9850 4.5590 4.6214 4.5463 3.6074 5.5191 4.2269 3.4381 1.6962 2.2359 3.1061 5.3682 3.6942 3.4317 3.9106 3.0870 3.7107 1.2610 1.1897 3.2047 2.6560 2.8323 2.3589 1.1452 4.3011 5.0080 4.5843 4.1386 3.1549 4.7301 3.2794 1.5172 1.4121 1.3083 3.1525 2.0810 2.5226 1.3529 1.3903 2.6093 2.4052 2.5072 1.5177 4.4122 1.9451 2.1371 2.3263 1.3977 1.6670 1.1610 1.1557 2.8537 1.1157 1.7245 1.6582 1.4487 1.3028 3.0524 2.8709 1.2361 3.6050 1.1025 1.0473 1.1892 1.6906 1.0529 3.0235 5.0369 1.3317 8.4345 5.2061 4.8612 1.0362 1.0603 1.0591 1.1029 1.0977 1.1033 1.0893 1.1051 1.0891 1.0948 1.0957 1.0763 1.0458 1.0771 1.1021
irintensity: 1.5628 0.4376 6.4993 4.2466 0.5751 0.5154 0.1784 1.1209 4.5260 10.0902 0.6285 14.9382 24.0558 8.7187 4.6061 0.7974 2.0822 41.6486 128.8400 21.6968 19.0752 6.4441 53.8348 256.8240 1.0127 6.5602 9.7400 25.4420 13.7247 14.7490 1.6291 3.3470 66.1949 13.5149 17.7503 21.8111 49.1029 0.9877 0.6749 7.1987 2.2786 18.1012 138.2639 293.8308 105.2998 25.5352 7.1750 13.2216 60.0124 153.4335 13.0979 297.7847 2.3087 69.0390 106.8077 46.8729 13.8586 22.9536 85.9419 25.4358 0.9142 40.6650 15.0300 11.9627 53.7332 21.1873 179.8121 14.4660 134.1884 304.8461 240.3402 210.4064 26.0422 29.5651 41.3306 8.1058 41.1693 3.4920 18.3858 31.7284 5.6041 6.3208 2.3074 25.0002 36.4753 40.7078 40.8186
temp: 298.150 k
press: 1.00000 atm
elementType: 8 8 7 7 7 6 6 6 6 6 6 6 6 6 6 6 1 1 1 1 1 1 1 1 1 1 1 1 1 1 1
symmnumber: 1
zpe: 658789.4 jmol-1
zpe.correction: 0.250920 hartree
zpe.thermalcorrener: 0.267153 hartree
zpe.thermalcorrenthalpy: 0.268097 hartree
zpe.thermalcorrgfe: 0.205644 hartree
zpe.sumelectzpe: -741.684473 hartree
zpe.sumelectthermal: -741.668239 hartree
zpe.sumelectthermalent: -741.667295 hartree
zpe.sumelectthermalfe: -741.729748 hartree
dipole: 2.5673 0.8676 1.7499
dipole: 3.2258
quadrupole: -89.3928 -91.3151 -92.5013
quadrupole: 21.0335 11.4851 -7.6145
quadrupole: 1.6769 -0.2454 -1.4316 21.0335 11.4851 -7.6145
hfenergy: -741.9353924 hartree
pointgroup: C01 [X(C11H15N3O2)]
dipole: 0.9968891 0.6308765 0.467879 debye
polarizability: 234.8704967|-1.5144249|143.7696429|-15.8528166|-15.4936838|99.9385677 unknown
InChI: InChI=1S/C11H15N3O2/c1-2-16-11(15)8-3-5-9(6-4-8)14-7-10(12)13/h3-6,12,14H,2,7,13H2,1H3
charge 0 multiplicity 1
31 atoms
O  -3.10003 -1.099404 0.804884
O  -3.633726 1.085083 0.164811
N  2.786265 0.852043 -0.917458
N  4.159291 0.234009 1.425644
N  4.781551 -1.922371 0.46507
C  1.43108 0.647565 -0.619649
C  -1.330917 0.301921 0.001666
C  0.501448 1.714994 -0.81346
C  0.955167 -0.597367 -0.109183
C  3.775238 -0.230484 -0.962525
C  -0.854107 1.542014 -0.506001
C  -0.408006 -0.760084 0.191807
C  -2.774399 0.174938 0.310149
C  4.270366 -0.713072 0.415066
C  -4.53867 -1.331232 1.123304
C  -5.312656 -1.761511 -0.126818
H  3.016733 1.713966 -1.412464
H  0.855209 2.675757 -1.208946
H  1.648495 -1.427969 0.054735
H  4.658172 0.131352 -1.519149
H  3.398463 -1.121556 -1.496543
H  -1.571947 2.355684 -0.653736
H  -0.773326 -1.714674 0.580845
H  -4.51191 -2.125906 1.886577
H  -4.958766 -0.403966 1.551583
H  -6.355455 -2.010624 0.145433
H  -5.334949 -0.946449 -0.869114
H  -4.85294 -2.653246 -0.58725
H  4.438943 0.021258 2.380862
H  3.627171 1.085341 1.240091
H  5.156609 -2.18461 1.399968
