program: Gaussian 09
title: 000290244
version: EM64L-G09RevD.01
frameworkgroup: C1[X(C9H10N4O2)]
method: RPBEPBE
basis: SDD
operation: Freq
keyword: #p
keyword: freq=noraman
keyword: PBEPBE/SDD
title: #p freq=noraman PBEPBE/SDD
converged: YES YES NO NO
title: Mulliken charges:
elementType: O O N N N N C C C C C C C C C H H H H H H H H H H
charge: -0.230436 -0.338501 -0.077087 -0.620040 -0.637069 -0.032956 0.141494 0.038159 0.210661 0.054583 -0.319385 -0.228148 0.201845 -0.674765 -0.230732 0.227672 0.227584 0.227622 0.209497 0.235247 0.235342 0.391156 0.321797 0.321932 0.344526
chargesum: 0.00000
title: Mulliken charges with hydrogens summed into heavy atoms:
elementType: O O N N N N C C C C C C C C C
charge: -0.230436 -0.338501 -0.077087 0.092914 0.029389 -0.032956 0.141494 0.038159 0.210661 0.054583 -0.091713 0.227058 0.201845 0.005322 -0.230732
polarizability: 2.03076807e+02 -1.82381820e+01 1.69694193e+02 5.84539042e-02 2.11923424e-02 6.18466036e+01
1716.lowfreq: -7.7165 -4.7780 -0.0003 -0.0003 0.0008 4.9470 27.9767 50.0321 85.1890
frequency: 27.5855 50.0301 85.1826 95.8554 101.6807 129.5794 137.4827 231.9327 243.8646 252.2141 283.9519 288.4988 351.4780 390.1922 393.3947 428.3147 434.5121 467.4899 474.9575 528.2188 558.9510 594.4155 596.5519 637.3031 657.3296 680.8385 729.1945 738.3253 778.4074 802.2967 810.6928 843.0543 873.1505 901.6066 1018.1451 1040.0834 1065.2365 1091.4393 1120.2027 1135.0023 1182.4595 1245.8540 1270.4885 1322.0932 1336.7820 1363.7393 1397.4898 1401.0988 1430.9755 1444.0887 1461.2879 1472.4197 1486.3863 1494.4822 1561.1396 1585.9254 1615.7650 1633.8546 2173.3883 2998.4891 3012.1442 3072.6209 3095.4223 3112.1399 3153.0962 3294.3612 3539.4207 3627.4902 3690.6055
redmass: 4.0954 3.2186 2.5309 5.0595 5.0545 6.3402 3.6181 1.4318 4.9254 4.7025 4.0571 6.7711 3.8744 5.4252 1.9013 8.0056 6.6831 3.9632 1.5671 8.0983 1.2051 5.2838 1.2586 5.9897 5.2951 6.8030 5.4098 9.3354 4.1532 1.0966 4.2635 1.1900 4.2655 1.5447 2.3567 2.4357 2.4301 2.7002 2.5498 1.4481 4.1067 1.1398 1.6459 2.0054 4.0318 2.8348 3.8980 1.4447 2.6604 3.0179 1.0395 1.1202 1.1655 4.2129 4.2002 1.7300 4.7517 1.5973 12.6182 1.0360 1.0579 1.1068 1.0985 1.1026 1.0917 1.0615 1.0453 1.0907 1.1037
irintensity: 9.9511 1.8570 0.1743 1.6633 2.7214 7.5746 3.1331 1.1008 1.7092 4.0044 3.3710 6.3035 9.4930 2.1077 11.1769 1.2729 1.2553 11.5717 132.5252 0.0904 7.5294 42.7802 285.5134 2.4354 12.1524 5.3742 0.3441 0.0147 2.2973 4.0287 4.2635 156.0535 34.4747 21.9821 73.0882 2.1007 9.5658 23.7441 6.1454 5.3531 164.6094 0.0005 82.6281 254.5616 111.8128 59.2877 295.3542 9.0553 67.8047 20.8007 12.4436 16.8482 17.5963 152.3221 69.9383 310.7249 679.4431 245.3033 90.5099 20.8483 18.7822 8.8608 25.3314 39.4714 7.4873 240.0519 66.4744 84.4633 33.7147
temp: 298.150 k
press: 1.00000 atm
elementType: 8 8 7 7 7 7 6 6 6 6 6 6 6 6 6 1 1 1 1 1 1 1 1 1 1
symmnumber: 1
zpe: 493723.7 jmol-1
zpe.correction: 0.188049 hartree
zpe.thermalcorrener: 0.202619 hartree
zpe.thermalcorrenthalpy: 0.203563 hartree
zpe.thermalcorrgfe: 0.145678 hartree
zpe.sumelectzpe: -717.349241 hartree
zpe.sumelectthermal: -717.334672 hartree
zpe.sumelectthermalent: -717.333728 hartree
zpe.sumelectthermalfe: -717.391613 hartree
dipole: 1.8394 -2.8180 0.0267
dipole: 3.3653
quadrupole: -80.6484 -90.0988 -89.0692
quadrupole: 26.4602 0.0651 0.0672
quadrupole: 5.9570 -3.4933 -2.4637 26.4602 0.0651 0.0672
hfenergy: -717.5372908 hartree
pointgroup: C01 [X(C9H10N4O2)]
dipole: 0.7514067 1.0799206 -0.1487264 debye
dipolederiv: -1.9243025 0.5603927 -0.1641465 0.4803605 -0.4935321 0.055449 -0.1523204 0.0592021 -0.2997456 -1.0403459 -0.2545617 0.0104566 -0.1950318 -0.9028167 0.0702283 0.002059 0.0678137 -0.4005848 -1.0973983 -0.3964813 0.0239543 -0.4004976 -0.5962866 0.0380528 0.024758 0.0380389 -0.2469165 -0.6156815 -0.4612863 0.0736924 -0.4958095 -1.2868938 0.0835442 0.0787265 0.0853417 -0.628906 -0.8323994 0.4515461 -0.0757296 0.6856904 -0.841528 0.0544374 -0.1126295 0.044284 -0.7024641 -0.3283349 -0.1888142 0.0256712 -0.2013995 -0.5590299 0.0374979 0.0290557 0.0403729 -0.2614924 -1.1793495 0.2114768 -0.0841851 -0.5780444 -0.7062474 0.0787585 0.0406704 0.1139928 -0.0613752 1.9347393 -0.3566521 0.136635 -0.180553 0.8194839 -0.1085847 0.1086047 -0.117144 0.211293 -0.9510088 -0.2285092 -0.007916 0.3054101 -0.4465519 0.0914544 -0.0933267 0.0671009 0.025086 0.8404882 0.4359176 -0.0387536 0.4949666 1.4534523 -0.1799357 -0.0493662 -0.1819664 0.2049764 0.9901662 0.3081518 -0.0005281 0.5120862 0.2437859 -0.0308079 -0.031313 -0.0404184 -0.0879464 0.8570735 -0.2943477 0.0704195 -0.617699 0.5344989 -0.0588815 0.1222584 -0.0440533 0.3542014 2.1114712 -0.182953 0.1103579 -0.3669411 1.273675 -0.171698 0.1382349 -0.1639326 0.2922692 -0.1604212 0.0066824 -0.0112963 0.0423094 0.0443309 0.0038744 -0.0168167 0.0022043 0.0553618 0.1808684 0.4201253 -0.0596615 0.3699229 0.5689806 -0.0663382 -0.0523224 -0.064974 0.0485398 0.0484917 0.0965287 -0.0197015 0.0924595 -0.0172379 0.0299452 -0.0190546 0.0299834 0.1391261 -0.0183355 -0.0302282 -0.0645322 0.0926568 -0.058012 -0.055847 -0.0569184 -0.0880659 -0.0413852 -0.0286973 -0.0164099 0.0752312 0.1004296 -0.0128663 0.0573808 0.0296381 0.0783986 -0.0754462 -0.0165909 0.0907588 -0.020559 0.1308668 -0.0884559 0.0384247 -0.0269156 0.0365733 0.1100029 0.0808274 -0.0177255 -0.017914 -0.091187 0.0214304 -0.1166217 -0.036798 -0.1027249 -0.0283613 0.0731092 -0.0176045 0.0361213 -0.0828209 0.0794398 0.0746207 0.0767857 0.067202 -0.0783027 0.4722765 -0.0544706 0.0132807 -0.0446339 0.3397186 0.0016325 0.0122365 0.0006724 0.3620899 0.1474933 0.0295374 -0.0144041 0.0659883 0.286983 0.0148493 -0.02002 0.0132946 0.3589272 0.215764 -0.0747812 0.0041507 -0.0920599 0.1594605 0.0293291 0.006846 0.0299091 0.373323 0.2400967 -0.0362921 -0.0006433 -0.0264696 0.1842185 0.0292358 -0.0020723 0.0288951 0.3777297 unknown
polarizability: 203.7075149|18.1159387|166.3940573|3.4628557|-15.8141043|64.516031 unknown
InChI: InChI=1S/C9H10N4O2/c1-2-15-9-5(4-10)3-6(8(12)14)7(11)13-9/h3H,2,11-12H2,1H3
charge 0 multiplicity 1
25 atoms
O  -2.496153 0.326006 0.075369
O  3.842536 1.263881 0.216673
N  -0.426746 1.440147 -0.007134
N  1.593506 2.594089 -0.098126
N  3.829402 -1.008426 0.567217
N  -1.933751 -3.170766 0.664938
C  1.67334 0.168986 0.289546
C  -1.124953 0.303408 0.14178
C  -0.514944 -0.979827 0.373602
C  0.947455 1.406206 0.060781
C  0.89628 -1.00163 0.440892
C  -3.161212 1.644331 -0.164363
C  3.160008 0.182042 0.35365
C  -4.659378 1.363351 -0.19143
C  -1.295476 -2.166952 0.527215
H  1.367624 -1.973643 0.6174
H  -2.868185 2.332969 0.648329
H  -2.784008 2.05449 -1.118316
H  -5.211098 2.305155 -0.365476
H  -4.912968 0.655493 -0.998516
H  -4.99678 0.932534 0.766339
H  2.626753 2.57173 -0.047222
H  1.03856 3.433203 -0.25633
H  3.370401 -1.907489 0.683769
H  4.846886 -0.96609 0.605616
