program: Gaussian 09
title: 000290242
version: EM64L-G09RevD.01
frameworkgroup: C1[X(C8H8N4O)]
method: RPBEPBE
basis: SDD
operation: Freq
keyword: #pfreq=noraman
keyword: PBEPBE/SDD
title: #p freq=noraman PBEPBE/SDD
converged: NO YES NO NO
title: Mulliken charges:
elementType: O N N N N C C C C C C C C H H H H H H H H
charge: -0.241337 -0.402686 -0.038029 -0.047771 -0.616936 0.110991 0.080575 -0.411414 0.452214 -0.016937 -0.460910 0.150353 -0.800021 0.287702 0.323445 0.251456 0.234602 0.236224 0.234789 0.358133 0.315557
chargesum: 0.00000
title: Mulliken charges with hydrogens summed into heavy atoms:
elementType: O N N N N C C C C C C C C
charge: -0.241337 -0.079240 -0.038029 -0.047771 0.056753 0.110991 0.080575 -0.123712 0.452214 -0.016937 -0.209454 0.150353 -0.094407
polarizability: 1.78783709e+02 4.74235323e+00 1.28758850e+02 1.45890560e-02 -8.56554285e-03 5.13806946e+01
1716.lowfreq: -73.7204 0.0006 0.0007 0.0008 1.6975 8.4381 8.7634 64.7915 148.1855
frequency: -73.7113 64.7694 148.1811 167.4365 196.6646 208.6220 295.0331 321.8334 349.6504 360.6782 412.5516 430.8041 483.0114 532.4007 544.2335 546.5617 594.7497 620.8419 632.8517 695.6530 697.7784 711.2894 802.5864 832.1786 909.4850 918.5730 969.4177 981.3447 993.2701 1021.8593 1054.0229 1114.6396 1179.7370 1209.4923 1273.5134 1286.7518 1339.1761 1363.6905 1382.4815 1403.5715 1454.5192 1462.9885 1470.8826 1483.3032 1559.3245 1577.6459 1590.8668 1612.6381 1635.8321 2981.9872 3060.9086 3092.3844 3125.7899 3150.5102 3526.6244 3550.9497 3703.5916
redmass: 1.0330 4.5771 5.6437 4.3695 5.7947 3.9346 1.1262 3.6304 4.1578 4.7095 5.4731 4.5374 7.1206 1.7209 1.4934 6.9997 6.5333 1.2500 6.1156 7.0337 8.7261 7.2453 6.8203 5.5302 1.3845 4.8349 1.3831 3.3414 1.4487 2.2420 1.5527 2.5072 2.7780 3.1748 2.2020 2.0543 5.8539 2.4141 3.4675 1.2296 3.3275 3.2449 1.0447 1.3832 5.2763 3.6596 2.3667 7.2390 2.3353 1.0376 1.0979 1.0987 1.0920 1.0928 1.0773 1.0457 1.1053
irintensity: 0.3856 7.2146 0.1544 2.0072 4.8167 9.9838 62.3947 1.4164 2.8626 4.1892 1.0357 0.0080 3.4423 246.9902 60.2614 2.5272 1.9930 77.5128 3.6294 1.8962 11.1903 0.4890 19.7933 0.5364 14.4523 7.8420 0.9961 2.0653 33.7006 13.4346 13.3926 11.4272 5.0056 20.9281 4.5818 56.2165 30.4794 10.0144 75.3908 14.6407 326.4875 4.5397 14.6175 24.6750 262.7446 234.4228 124.3517 258.7215 453.8072 29.6580 18.4491 13.1516 21.3274 4.4773 41.4161 130.4989 46.2028
temp: 298.150 k
press: 1.00000 atm
elementType: 8 7 7 7 7 6 6 6 6 6 6 6 6 1 1 1 1 1 1 1 1
symmnumber: 1
zpe: 413262.7 jmol-1
zpe.correction: 0.157403 hartree
zpe.thermalcorrener: 0.167724 hartree
zpe.thermalcorrenthalpy: 0.168668 hartree
zpe.thermalcorrgfe: 0.121621 hartree
zpe.sumelectzpe: -602.992031 hartree
zpe.sumelectthermal: -602.981711 hartree
zpe.sumelectthermalent: -602.980767 hartree
zpe.sumelectthermalfe: -603.027814 hartree
dipole: -0.0521 -6.0867 -0.0047
dipole: 6.0869
quadrupole: -48.2657 -85.5951 -77.4385
quadrupole: 16.9181 0.0130 -0.0159
quadrupole: 22.1674 -15.1620 -7.0054 16.9181 0.0130 -0.0159
hfenergy: -603.1494348 hartree
pointgroup: C01 [X(C8H8N4O1)]
dipole: -0.0819702 -2.3910835 -0.1045003 debye
dipolederiv: -0.5632071 0.0840797 0.0019348 0.0095347 -1.218036 -0.0359418 -0.0012138 -0.0358922 -0.3726073 -1.4756227 -0.0264362 -0.0113387 -0.2310195 -0.5547762 -0.013512 -0.0211467 -0.0120445 -0.2708287 -0.6373125 0.2083959 0.0060274 -0.1206392 -0.3218341 -0.0047069 -0.0091508 -0.0019307 -0.242916 -1.0098279 0.5520718 0.0180063 0.5451292 -1.2339752 -0.0355353 0.0177817 -0.0345654 -0.3222029 -1.5359432 0.4931629 0.0156923 0.5331563 -0.4533992 0.0163131 0.0196558 0.0148588 -0.7353387 -0.5751712 -0.2540497 -0.0164715 0.1697938 -0.309032 -0.0144334 0.0026678 -0.0175465 0.0513882 1.1394674 -0.1847328 0.000499 -0.4245077 0.1449268 -0.0024858 -0.0104752 -0.0009432 0.1198796 0.162806 0.195743 0.0107049 -0.1137004 0.1530583 0.010007 -0.0026414 0.0126043 -0.0906779 0.2848314 -0.1636017 -0.0049587 -0.3516147 -0.3595641 -0.0183313 -0.0126392 -0.0172797 -0.0126149 1.3236578 -0.3357975 -0.0045885 -0.0434176 1.5568832 0.0570184 0.0074285 0.0547043 0.2022771 0.1629709 -0.1243656 -0.0032177 0.3273331 0.4066352 0.0253777 0.0171119 0.0220471 -0.0946187 2.1154624 -0.2892478 0.0023281 -0.2839843 1.553607 0.055524 0.0030326 0.0560059 0.2594338 -0.1752121 0.0367492 -0.0003972 -0.0237156 0.0718671 -0.0002669 -0.0045127 0.0003275 0.0723329 0.1245092 0.0124737 0.0004919 0.0696156 0.0174265 -0.0050033 0.0029409 -0.005407 0.139679 0.1527249 -0.036524 -0.003146 0.0146165 0.1795833 -0.0074212 -0.0006647 -0.0083452 0.3399057 -0.0515156 -0.0933519 -0.0056565 -0.1059771 0.0286805 -0.0053188 -0.006135 -0.0051804 0.1260573 -0.0295809 -0.0018415 0.0695977 -0.0204167 0.0662497 0.0921398 0.124998 0.0572589 -0.028426 0.0698912 -0.0390836 -0.0022253 0.0813092 -0.1197194 -0.0108464 0.0038241 -0.011606 0.1122467 -0.0266779 0.0058583 -0.0693195 -0.0062152 0.0801852 -0.0812882 -0.1260104 -0.0464361 -0.0455868 0.3199984 -0.0050257 -0.0009974 0.0483462 0.1605121 -0.0101095 0.0008836 -0.0104558 0.3962741 0.2237513 -0.0344765 -0.0029654 -0.0736267 0.1507214 -0.0111793 -0.0057348 -0.0101742 0.3963435 unknown
polarizability: 178.2783388|-6.9019386|129.10816|0.7301328|3.3876622|51.5367555 unknown
InChI: InChI=1S/C8H8N4O/c1-4-2-5-6(10-3-4)11-8(9)12-7(5)13/h2-3,11H,9H2,1H3
charge 0 multiplicity 1
21 atoms
O  0.846629 2.693466 0.132794
N  1.355884 -1.379479 -0.040805
N  -0.957607 -1.825539 -0.08026
N  2.28847 0.844951 0.067395
N  3.692239 -1.015086 -0.004805
C  -0.169231 0.50487 0.031022
C  0.037905 -0.898263 -0.0302
C  -1.508028 0.958422 0.041069
C  -2.575697 0.033394 -0.008825
C  1.006206 1.439183 0.080848
C  -2.232211 -1.348528 -0.068813
C  2.422382 -0.479769 0.009098
C  -4.028154 0.467398 -0.000562
H  -1.679662 2.039458 0.087991
H  1.473091 -2.394635 -0.087957
H  -3.020082 -2.110639 -0.109817
H  -4.571217 0.044439 0.864946
H  -4.115355 1.565516 0.052745
H  -4.555102 0.132209 -0.913223
H  4.460236 -0.34852 0.032101
H  3.884306 -2.01225 -0.045737
