program: Gaussian 09
title: 000290241
version: EM64L-G09RevD.01
frameworkgroup: C1[X(C10H10N2O2S)]
method: RPBEPBE
basis: SDD
operation: Freq
keyword: #p
keyword: freq=noraman
keyword: PBEPBE/SDD
title: #p freq=noraman PBEPBE/SDD
converged: NO NO NO NO
title: Mulliken charges:
elementType: S O O N N C C C C C C C C C C H H H H H H H H H H
charge: 0.284897 -0.250672 -0.245407 -0.342971 -0.409466 0.488859 -0.482785 -0.418979 -0.413068 -0.446878 -0.405173 0.147357 -0.287376 0.137177 0.135704 0.257720 0.228841 0.207833 0.215848 0.214541 0.213837 0.228902 0.229411 0.347704 0.364146
chargesum: 0.00000
title: Mulliken charges with hydrogens summed into heavy atoms:
elementType: S O O N N C C C C C C C C C C
charge: 0.284897 -0.250672 -0.245407 0.004733 -0.045320 0.488859 0.003777 0.004702 0.015309 0.011435 -0.405173 0.147357 -0.287376 0.137177 0.135704
polarizability: 2.03476093e+02 -6.25574884e-01 1.53717537e+02 -1.41101889e-01 1.13707803e+00 7.17374754e+01
1716.lowfreq: -0.0020 0.0005 0.0008 9.1142 11.1436 13.4090 60.8944 97.2410 117.3730
frequency: 60.8937 97.2323 117.3716 163.7454 165.8747 177.1338 244.6279 284.9034 316.5161 330.8783 339.9214 360.4417 415.4795 452.5689 478.1317 517.2201 535.1423 561.8444 592.3703 600.4412 622.7643 636.0689 690.8220 739.4802 768.6175 778.1727 818.0210 844.9482 881.6215 900.3721 956.9638 963.5919 986.0126 1004.7126 1080.9256 1095.4176 1136.5623 1147.7948 1161.6246 1171.9971 1238.1361 1239.0976 1252.8202 1297.8198 1324.7361 1337.7098 1345.4126 1349.5327 1367.4590 1418.7942 1451.7020 1460.9152 1466.4452 1468.1939 1472.1264 1537.8872 1591.8908 1634.6224 1671.6429 2964.2738 2982.4802 2985.4266 2989.0725 3019.3415 3048.4950 3053.3186 3060.6252 3529.3306 3561.7536
redmass: 5.8852 3.4440 3.1296 6.0765 8.4576 5.0020 3.2839 2.1043 5.7384 4.3394 8.8435 6.9979 7.6497 4.6818 3.8384 4.2296 4.8139 6.5467 1.4995 3.0170 4.8851 5.2498 2.5609 3.0901 2.6393 3.0008 1.5081 2.8131 8.3985 1.4802 2.6103 4.7000 3.5122 3.0873 1.8724 1.8134 1.1686 3.6732 2.1543 1.9901 1.2823 4.1598 1.2922 1.9259 1.4175 1.6432 1.5652 1.7264 1.8451 2.7997 1.1775 1.1062 2.0163 1.3785 1.0998 9.9682 6.4474 7.7314 5.3493 1.0625 1.0689 1.0625 1.0629 1.0952 1.0959 1.0990 1.1012 1.0770 1.0783
irintensity: 0.2173 0.3335 0.2359 3.5079 3.7869 0.2902 7.2234 2.4593 3.4284 1.0704 2.9630 8.8804 19.9122 0.8085 5.4757 3.2040 5.4513 3.5974 56.8170 28.6598 12.4451 1.2217 2.8171 66.1322 22.8005 89.1824 4.7480 6.5378 5.4176 0.8201 5.2399 12.3482 29.8662 15.4947 0.4095 4.1983 2.3870 30.3142 2.6194 0.7697 4.5343 29.4967 1.4290 76.4650 8.3945 36.5419 8.6634 38.3325 33.1760 11.0601 0.7995 25.8917 92.4324 46.7971 1.9937 29.4609 10.4097 391.5386 836.6281 34.0483 19.8788 28.1416 30.2270 30.0642 51.3458 23.3672 47.6048 68.2953 87.1679
temp: 298.150 k
press: 1.00000 atm
elementType: 16 8 8 7 7 6 6 6 6 6 6 6 6 6 6 1 1 1 1 1 1 1 1 1 1
symmnumber: 1
zpe: 498366.0 jmol-1
zpe.correction: 0.189818 hartree
zpe.thermalcorrener: 0.202260 hartree
zpe.thermalcorrenthalpy: 0.203205 hartree
zpe.thermalcorrgfe: 0.151104 hartree
zpe.sumelectzpe: -1044.044050 hartree
zpe.sumelectthermal: -1044.031608 hartree
zpe.sumelectthermalent: -1044.030663 hartree
zpe.sumelectthermalfe: -1044.082763 hartree
dipole: 4.0761 -2.6998 -0.0417
dipole: 4.8893
quadrupole: -100.3536 -96.3119 -94.9278
quadrupole: 0.3436 0.0852 -0.0168
quadrupole: -3.1558 0.8858 2.2700 0.3436 0.0852 -0.0168
hfenergy: -1044.2338679 hartree
pointgroup: C01 [X(C10H10N2O2S1)]
dipole: -1.5892171 1.0834803 -0.0257877 debye
dipolederiv: -0.4094369 -0.0136737 0.0124925 0.0918375 -0.2522866 0.0085244 0.0018576 0.0110861 0.0959929 -0.597044 -0.0700218 0.0034857 -0.0671875 -1.2594684 0.0234706 -0.0044984 0.0228847 -0.3450303 -1.7090181 -0.1105181 -0.0000418 -0.1442851 -0.5113717 0.0027239 0.0026261 0.002898 -0.3849448 -1.5001966 -0.1138065 0.0013457 0.6110999 -0.5409168 0.0054365 -0.0203448 0.0068308 -0.2700246 -1.0381034 -0.4012387 0.009048 -0.4420382 -0.6974442 0.0085358 0.0106546 0.0075997 -0.352031 0.0248873 0.0005966 -0.0129846 0.2011611 0.0123327 0.0000032 -0.0617345 -0.0280015 -0.0134105 0.0793608 0.0427227 0.006462 -0.0114765 -0.0104552 -0.0175392 0.0180154 -0.0092623 0.1396663 0.0893736 0.0505525 -0.0121512 0.020795 0.0532832 -0.0265559 0.0381774 -0.0058366 0.1387204 0.0840368 0.0016859 0.0277064 0.1417937 0.0597815 -0.0224016 -0.0488162 -0.0388116 0.1357543 0.0241574 -0.0843155 0.0304141 -0.1398745 -0.0259729 0.0157758 -0.0017595 0.035827 0.1960408 0.3392938 0.2664337 -0.0123922 0.136434 0.1698654 -0.0096244 0.0637793 -0.0223733 -0.2096735 -0.2465749 0.1649204 -0.0060705 0.0934495 -0.8960444 0.0138969 0.000216 0.0224974 -0.0392148 0.9461976 0.1506597 -0.0052696 -0.206212 0.6877422 -0.0116034 0.0126917 -0.0219587 -0.0360084 1.3765227 0.0043005 0.0005332 0.0303863 1.6001674 -0.0365197 -0.0015501 -0.0327536 0.2633312 2.3195795 0.1255865 0.0010483 -0.2832298 1.1610525 -0.021048 0.0095752 -0.0205159 0.3179498 0.039553 0.0400403 0.0448364 0.0093896 -0.002152 -0.0621886 0.0438555 -0.0723822 0.0331922 0.0288369 -0.049138 -0.0090286 -0.0419769 0.0160662 0.0586919 -0.0190855 0.0911277 -0.0864126 0.0484188 0.0199557 0.0032642 0.0595328 0.0606973 0.0544444 -0.0452027 -0.0045827 -0.1725911 -0.0662749 -0.1206983 0.0150648 -0.1506186 -0.1053894 0.0178222 0.0422777 0.039729 0.0762523 0.098771 -0.0033706 -0.0434533 -0.0289936 0.020955 0.0305697 0.0315574 0.0171482 -0.1663946 -0.2423874 0.0392602 -0.0170571 0.0257894 0.0451259 0.0054611 -0.0443313 0.012217 0.078081 0.0142357 0.0151429 0.0053409 0.0503243 -0.0757306 -0.0966829 0.0599475 -0.1201033 0.0178644 -0.0711584 0.0457514 -0.0414306 0.0198062 0.0507061 0.0527642 -0.0862452 0.1006725 -0.0967836 0.1813568 0.0511392 -0.0021967 0.0775145 0.2398773 0.0028247 -0.0024323 0.0027466 0.3426374 0.1856129 -0.051967 0.001034 -0.0534212 0.1995794 0.0032184 0.0007692 0.0033172 0.3370366 unknown
polarizability: 203.4503|-1.2947703|153.7156719|0.0938107|-1.8892045|71.7651336 unknown
InChI: InChI=1S/C10H10N2O2S/c13-8-7-5-3-1-2-4-6(5)15-9(7)12-10(14)11-8/h11-12H,1-4H2
charge 0 multiplicity 1
25 atoms
S  -0.3806 2.359238 -0.064352
O  0.901202 -2.584096 0.0643
O  4.431453 0.49713 -0.005825
N  2.23892 1.324633 -0.029448
N  2.613607 -0.998424 0.028044
C  -1.12985 -0.213454 0.001357
C  -2.009516 -1.450041 0.027579
C  -3.471013 -1.109614 -0.35518
C  -3.970199 0.163283 0.370046
C  -3.139982 1.410127 -0.044525
C  -1.675221 1.055838 -0.032984
C  0.324589 -0.208572 0.008091
C  0.874127 1.077767 -0.025791
C  1.225768 -1.361703 0.036248
C  3.189892 0.280498 -0.001862
H  -1.590335 -2.218449 -0.645517
H  -1.97274 -1.897427 1.041061
H  -3.539149 -0.951583 -1.450198
H  -4.124759 -1.967637 -0.111945
H  -3.88514 0.016593 1.464417
H  -5.037262 0.345802 0.144134
H  -3.35186 2.251059 0.644081
H  -3.446513 1.746553 -1.056537
H  2.625746 2.269912 -0.052844
H  3.275637 -1.780636 0.04765
