program: Gaussian 09
title: 000290239
version: EM64L-G09RevD.01
frameworkgroup: C1[X(C13H10N2OS)]
method: RPBEPBE
basis: SDD
operation: Freq
keyword: #p
keyword: freq=noraman
keyword: PBEPBE/SDD
title: #p freq=noraman PBEPBE/SDD
converged: YES YES NO NO
title: Mulliken charges:
elementType: S O N N C C C C C C C C C C C C C H H H H H H H H H H
charge: 0.312848 -0.258452 -0.440496 0.023267 0.185670 0.531139 -0.505938 0.111988 0.102326 0.312917 -0.733829 -0.772022 -0.352046 -0.327059 -0.226530 -0.250017 -0.228391 0.338337 0.276316 0.247901 0.248478 0.213945 0.284390 0.201168 0.234707 0.233205 0.236177
chargesum: 0.00000
title: Mulliken charges with hydrogens summed into heavy atoms:
elementType: S O N N C C C C C C C C C C C C C
charge: 0.312848 -0.258452 -0.102159 0.023267 0.185670 0.531139 -0.505938 0.111988 0.102326 0.312917 -0.457514 -0.061698 -0.067655 -0.125891 0.008177 -0.016811 0.007786
polarizability: 3.22771909e+02 -7.94889741e+00 1.89378727e+02 -5.97758277e-02 -1.67876607e+00 6.92543359e+01
1716.lowfreq: -6.7083 -4.4333 0.0004 0.0006 0.0010 1.9779 11.0755 51.2243 95.5433
frequency: 10.8899 51.2231 95.5414 106.5406 120.0100 175.3959 190.2461 218.9524 237.3945 252.8863 314.7646 328.8682 373.1056 398.1026 426.1736 462.0219 501.3111 531.5388 546.0156 598.2398 606.4448 617.0551 636.3261 684.4021 691.9501 696.9570 729.9771 755.4114 781.3244 781.4462 794.3165 825.7192 848.2890 932.8356 952.3416 986.2776 987.9914 999.3026 1011.6604 1021.3999 1035.1772 1043.9768 1087.6682 1099.2405 1144.5313 1175.2034 1198.8295 1208.0081 1273.8697 1289.0026 1327.8035 1384.8713 1394.3661 1407.0841 1428.2934 1442.2686 1447.4556 1456.4414 1468.1887 1492.5715 1519.3440 1544.1908 1590.8146 1612.9307 1643.1441 2992.8003 3079.1985 3096.2377 3120.0741 3136.1352 3149.6461 3164.9538 3176.4859 3225.3944 3520.5872
redmass: 4.0030 4.7814 2.6418 5.0307 1.4371 4.9095 5.5849 3.7604 4.1303 8.3232 6.1124 7.0723 4.8730 2.7702 9.5126 3.8619 8.1868 7.9974 4.4117 3.3686 8.4002 6.7152 5.9786 4.8663 1.7106 5.8046 1.6508 1.3278 3.2393 3.7227 3.4410 6.7173 1.2618 1.4346 6.7572 1.4266 5.0740 2.4346 1.3474 2.4651 2.4725 1.5003 1.6777 2.8708 2.3927 1.0594 1.1396 1.9331 3.7353 2.7365 1.5202 7.3167 2.4882 1.3956 3.9968 2.0613 3.1575 1.0436 1.8199 3.2943 3.9683 4.7940 5.8539 6.0073 6.6006 1.0359 1.0973 1.1010 1.0871 1.0871 1.0926 1.0969 1.0987 1.0956 1.0765
irintensity: 0.0132 1.8463 1.1436 0.3773 0.3609 9.8492 0.9019 3.0381 2.5565 1.7993 0.5450 0.3479 0.7774 0.0235 0.2003 3.9977 2.9269 0.8496 0.0726 0.2547 0.6618 0.2901 22.9124 1.7917 50.6411 8.2087 16.1311 125.8912 35.6647 23.6722 5.4776 24.1724 0.5496 5.0489 14.1447 0.5691 2.2777 7.1364 0.8813 0.1275 32.0122 8.3245 19.5081 2.7007 20.7191 0.6469 7.8177 5.3291 46.7955 12.1374 11.5908 0.6916 7.8422 19.4693 15.9272 3.2596 32.0276 13.6418 48.4549 91.3566 101.0695 73.9625 3.0624 1.5664 521.4802 27.2186 11.0199 20.9379 14.2582 0.3884 23.1093 20.0725 16.9721 1.1405 30.9688
temp: 298.150 k
press: 1.00000 atm
elementType: 16 8 7 7 6 6 6 6 6 6 6 6 6 6 6 6 6 1 1 1 1 1 1 1 1 1 1
symmnumber: 1
zpe: 524307.9 jmol-1
zpe.correction: 0.199698 hartree
zpe.thermalcorrener: 0.213840 hartree
zpe.thermalcorrenthalpy: 0.214784 hartree
zpe.thermalcorrgfe: 0.156827 hartree
zpe.sumelectzpe: -1083.025402 hartree
zpe.sumelectthermal: -1083.011261 hartree
zpe.sumelectthermalent: -1083.010317 hartree
zpe.sumelectthermalfe: -1083.068274 hartree
dipole: -2.3836 -0.5104 0.0106
dipole: 2.4377
quadrupole: -80.0110 -109.6311 -110.2772
quadrupole: -7.6261 -0.1642 -1.0422
quadrupole: 19.9621 -9.6580 -10.3041 -7.6261 -0.1642 -1.0422
hfenergy: -1083.2251006 hartree
pointgroup: C01 [X(C13H10N2O1S1)]
dipole: -0.9464828 -0.1542177 0.0132784 debye
polarizability: 321.6744037|-14.2438645|189.1818032|2.4232176|-12.55707|70.5487652 unknown
InChI: InChI=1S/C13H10N2OS/c1-8-7-17-13-10(8)12(16)14-11(15-13)9-5-3-2-4-6-9/h2-7,14H,1H3
charge 0 multiplicity 1
27 atoms
S  2.451659 -2.503126 0.216328
O  1.968589 2.583986 -0.131979
N  0.052445 1.247565 -0.048402
N  0.041202 -1.124236 0.106775
C  2.18687 0.143701 0.027548
C  3.617526 -0.086365 0.047348
C  1.406146 -1.035403 0.109263
C  -0.629205 0.034717 0.022824
C  1.48007 1.417061 -0.058678
C  -2.112624 0.026114 0.008243
C  3.90785 -1.438279 0.144411
C  4.661608 1.002501 -0.028443
C  -2.781544 -1.210996 0.220069
C  -2.889211 1.19771 -0.21026
C  -4.187943 -1.272786 0.220375
C  -4.298337 1.132093 -0.209702
C  -4.953955 -0.101443 0.007267
H  -0.467706 2.12875 -0.089063
H  4.890883 -1.905789 0.180281
H  4.54953 1.590829 -0.956024
H  4.54621 1.717386 0.805026
H  5.6797 0.578409 0.00391
H  -2.171115 -2.104218 0.380127
H  -2.420759 2.171279 -0.40032
H  -4.688891 -2.232369 0.38698
H  -4.88324 2.041739 -0.382383
H  -6.04826 -0.149331 0.007679
