program: Gaussian 09
title: 000290238
version: EM64L-G09RevD.01
frameworkgroup: C1[X(C13H9ClN2S)]
method: RPBEPBE
basis: SDD
operation: Freq
keyword: #p
keyword: freq=noraman
keyword: PBEPBE/SDD
title: #p freq=noraman PBEPBE/SDD
converged: NO NO NO NO
title: Mulliken charges:
elementType: Cl S N N C C C C C C C C C C C C C H H H H H H H H H
charge: -0.013462 0.326890 0.039719 0.056032 0.475680 0.526738 -0.489117 -0.138246 -0.435137 -0.720442 0.311284 -0.788645 -0.356245 -0.346503 -0.228489 -0.227905 -0.229835 0.278341 0.224230 0.246962 0.246907 0.273446 0.277288 0.229543 0.229997 0.230969
chargesum: 0.00000
title: Mulliken charges with hydrogens summed into heavy atoms:
elementType: Cl S N N C C C C C C C C C C C C C
charge: -0.013462 0.326890 0.039719 0.056032 0.475680 0.526738 -0.489117 -0.138246 -0.435137 -0.442100 0.311284 -0.070546 -0.082799 -0.069215 0.001054 0.002092 0.001134
polarizability: 3.25144785e+02 9.76415247e+00 2.02982699e+02 5.05601938e-03 -2.07523077e-02 6.98810795e+01
1716.lowfreq: -2.9478 -2.5353 -0.0020 -0.0020 -0.0016 5.1594 45.0557 48.9902 83.8764
frequency: 45.0236 48.9559 83.8734 96.0189 181.6644 190.0350 192.2594 209.5544 242.9670 243.6936 285.7090 311.3437 314.6184 388.7454 405.4618 456.6942 463.1949 520.5179 546.6363 579.9154 580.6997 602.7481 615.1007 686.7553 689.3049 704.3712 757.1618 772.5743 783.5862 793.1590 809.0952 816.0853 865.4825 956.5781 986.3493 989.3301 999.9660 1009.8800 1017.0550 1029.3639 1044.9652 1077.8140 1083.0432 1143.9973 1172.6963 1183.0919 1215.7176 1229.5137 1308.6317 1315.6491 1348.2015 1383.5833 1395.1523 1406.7924 1437.5965 1448.8029 1461.8083 1464.0985 1489.4317 1523.7415 1556.6614 1585.9229 1612.1063 2991.6452 3080.4068 3093.1736 3127.2218 3139.8976 3154.9334 3167.4467 3173.7654 3217.8880
redmass: 4.7168 4.1205 7.6454 6.2581 1.8900 11.0502 2.3918 3.1827 4.0418 4.6981 6.9011 5.6152 8.4886 6.2290 2.8651 10.9239 3.7198 7.5792 4.7646 8.8841 7.3931 8.5780 6.4820 5.5976 7.3113 1.7207 1.9464 6.3947 1.6282 10.6374 6.2795 3.5584 1.2451 1.4332 3.2985 5.6992 1.3761 1.3309 2.3554 2.1904 1.4888 1.7582 3.0385 2.2977 1.0557 1.1245 3.1931 3.0976 8.9541 1.4780 5.1915 5.6416 7.5451 1.2318 3.2634 4.2819 1.2219 1.0442 2.8817 4.9698 6.7297 6.3291 6.1673 1.0360 1.0981 1.1002 1.0853 1.0895 1.0943 1.0948 1.0992 1.0957
irintensity: 2.0383 0.5664 0.1714 1.0392 0.1207 0.8828 0.5072 0.0840 0.6806 1.0756 0.6537 0.5062 8.4053 2.0557 0.0006 1.7782 4.1634 0.2627 0.0005 0.1578 18.7730 9.2896 0.2788 1.0448 9.7988 70.2574 68.4708 2.3232 0.3873 87.5205 36.6314 19.4611 0.0001 5.4137 5.2854 2.3222 0.0004 0.8529 16.1856 13.6381 6.7467 7.5354 33.6730 44.0155 0.0622 20.3438 15.1058 52.2829 72.9167 16.7278 50.2027 112.9780 66.5433 27.3739 91.7558 183.3494 52.8228 16.5227 29.0717 51.0144 171.4078 0.4127 2.9833 25.8410 11.4357 16.8908 0.0647 15.1798 27.6093 9.4746 21.4369 1.6193
temp: 298.150 k
press: 1.00000 atm
elementType: 17 16 7 7 6 6 6 6 6 6 6 6 6 6 6 6 6 1 1 1 1 1 1 1 1 1
symmnumber: 1
zpe: 486323.4 jmol-1
zpe.correction: 0.185231 hartree
zpe.thermalcorrener: 0.199397 hartree
zpe.thermalcorrenthalpy: 0.200341 hartree
zpe.thermalcorrgfe: 0.143212 hartree
zpe.sumelectzpe: -1467.245627 hartree
zpe.sumelectthermal: -1467.231461 hartree
zpe.sumelectthermalent: -1467.230517 hartree
zpe.sumelectthermalfe: -1467.287646 hartree
dipole: -1.5143 -0.8290 -0.0041
dipole: 1.7263
quadrupole: -85.0183 -113.0250 -116.6503
quadrupole: 2.2135 -0.0037 -0.0127
quadrupole: 19.8796 -8.1271 -11.7524 2.2135 -0.0037 -0.0127
hfenergy: -1467.4308582 hartree
pointgroup: C01 [X(C13H9Cl1N2S1)]
dipole: 0.5990688 -0.3168744 0.0448141 debye
dipolederiv: -0.3224414 -0.3237196 0.0394773 -0.4192987 -0.8440313 0.0935392 0.0507147 0.092948 -0.0947849 -0.2141874 -0.0279967 0.0015552 0.2406752 -0.243129 0.0478195 -0.0326059 0.0462487 0.1167596 -1.1751516 0.1087879 -0.0192521 0.3804922 -0.4712201 0.0421848 -0.0535118 0.041043 -0.1573274 -1.3519103 -0.4740648 0.0527969 -0.3598911 -0.5263306 0.0480925 0.0395328 0.0467036 -0.1393789 -0.0141852 -0.3002607 0.0375814 -0.0417966 -0.8302514 0.1161861 0.0050265 0.1143905 0.0742831 0.0049989 0.1628023 -0.0207372 0.3928269 -0.017144 0.0040445 -0.0505465 0.002984 -0.002651 0.7392066 -0.1632973 0.0252186 -0.5910494 0.6495685 -0.0935062 0.0798015 -0.0912674 -0.0480332 1.853852 0.0982692 -0.0035753 0.0344618 0.5075402 -0.0547179 0.0031429 -0.0540023 0.0820593 1.1032022 0.5543117 -0.0632584 0.5621341 1.4327856 -0.1722374 -0.0642703 -0.1709907 0.063183 -0.1304549 0.3622408 -0.0445335 -0.0663187 0.1735231 -0.0604648 0.0094724 -0.0576454 -0.2918817 -0.5292766 0.0045774 -0.0031287 -0.0266681 -0.0355474 0.003676 0.0014868 0.0038266 -0.005609 0.0204364 -0.0515049 0.0062933 -0.1007048 -0.068704 0.0156526 0.0126053 0.0159224 0.0591206 0.0498032 -0.1018892 0.0134085 0.1733899 -0.0210812 -0.0119673 -0.0212281 -0.0133787 -0.1227197 0.0565549 0.1042358 -0.0122943 -0.166806 0.0018746 -0.0165222 0.022149 -0.0153303 -0.1218794 -0.1587586 0.1575175 -0.0198388 0.261493 0.0652113 -0.026406 -0.0327347 -0.0270807 -0.1525502 -0.1363265 -0.1604124 0.0200207 -0.2730923 0.0669192 -0.0289316 0.033977 -0.0282962 -0.1512099 0.0570969 0.0070978 -0.000163 -0.0048746 0.018353 -0.0205505 0.0014686 -0.0204158 -0.1431333 -0.0105445 0.0156906 -0.0034088 -0.0168451 0.0863871 0.014651 0.0008366 0.0148145 0.2006108 -0.1224824 0.0376094 -0.0067376 0.1622406 0.0426173 0.0107612 -0.0226294 0.0096951 0.1146755 0.0858787 -0.0175331 -0.0428132 -0.068894 0.0324021 0.0801974 0.0103844 0.0773687 -0.0439613 0.0857043 -0.0044036 0.0476231 -0.0675979 -0.0109107 -0.0894562 0.0090778 -0.0857043 0.0005533 0.1256042 0.0787127 -0.0098348 0.0688354 0.0132503 0.0175645 -0.0085786 0.017671 0.1491908 0.1374815 -0.0681282 0.0084879 -0.0695028 0.0104013 0.0172469 0.0085475 0.0173192 0.1492676 0.0016968 -0.0791324 0.0091949 -0.1222896 -0.0662323 0.0273955 0.0146869 0.0276575 0.1539143 -0.0044627 0.0837559 -0.0111717 0.1240105 -0.0614767 0.0278594 -0.0161982 0.0276238 0.153897 -0.1513344 -0.003266 -0.0009103 -0.0049297 0.0952249 0.007889 -0.0006072 0.0078953 0.157605 unknown
polarizability: 325.3260268|-8.2692717|200.6996376|2.3895397|-16.5539043|71.9828995 unknown
InChI: InChI=1S/C13H9ClN2S/c1-8-7-17-13-10(8)11(14)15-12(16-13)9-5-3-2-4-6-9/h2-7H,1H3
charge 0 multiplicity 1
26 atoms
Cl 2.070127 2.930102 -0.347622
S  2.473168 -2.53437 0.345969
N  0.058189 -1.180287 0.159286
N  0.007467 1.21816 -0.145147
C  2.171078 0.119995 0.006131
C  3.611253 -0.099486 0.043152
C  1.399884 -1.090948 0.155535
C  -0.623741 -0.002157 0.005972
C  1.335831 1.263168 -0.143729
C  3.906671 -1.439884 0.216179
C  -2.102504 -0.025708 0.002558
C  4.685306 0.957774 -0.084259
C  -2.797936 -1.256682 0.153522
C  -2.838181 1.180936 -0.151147
C  -4.206837 -1.277371 0.150217
C  -4.247484 1.15412 -0.153585
C  -4.936913 -0.073369 -0.003206
H  4.89866 -1.887236 0.279745
H  5.685875 0.49746 -0.016627
H  4.612802 1.491172 -1.048247
H  4.597566 1.717625 0.711986
H  -2.216524 -2.176046 0.270931
H  -2.286404 2.118681 -0.265954
H  -4.737659 -2.228739 0.267023
H  -4.809291 2.087236 -0.272305
H  -6.032703 -0.091946 -0.005378
