program: Gaussian 09
title: 000290234
version: EM64L-G09RevD.01
frameworkgroup: C1[X(C10H8Cl2N2S)]
method: RPBEPBE
basis: SDD
operation: Freq
keyword: #p
keyword: freq=noraman
keyword: PBEPBE/SDD
title: #p freq=noraman PBEPBE/SDD
converged: NO YES NO NO
title: Mulliken charges:
elementType: Cl Cl S N N C C C C C C C C C C H H H H H H H H
charge: 0.004802 0.025978 0.335149 0.144819 0.165127 -0.497291 -0.421504 0.494596 -0.413287 -0.449087 -0.419258 0.445021 -0.429171 -0.407934 -0.399092 0.234766 0.243130 0.220196 0.211175 0.219233 0.216550 0.237442 0.238640
chargesum: 0.00000
title: Mulliken charges with hydrogens summed into heavy atoms:
elementType: Cl Cl S N N C C C C C C C C C C
charge: 0.004802 0.025978 0.335149 0.144819 0.165127 -0.019395 0.009867 0.494596 0.022497 0.026995 -0.419258 0.445021 -0.429171 -0.407934 -0.399092
polarizability: 2.36028358e+02 -3.33126019e+00 1.68778949e+02 4.21917296e-02 -7.11846897e-01 7.34739441e+01
1716.lowfreq: -9.3931 -0.0030 -0.0019 0.0016 2.0310 4.7230 40.9389 86.4463 112.9023
frequency: 40.8922 86.4457 112.8991 149.5585 152.1086 187.5836 220.5196 239.9482 257.8562 290.3554 327.6948 361.3719 363.0830 414.7037 448.3312 455.8260 531.6913 543.0466 564.2677 570.7964 594.2478 652.7505 744.4007 765.8926 778.5241 797.0685 823.1110 847.8871 901.7210 933.1556 963.0619 998.3844 1080.8927 1094.9184 1117.9998 1138.9609 1170.2147 1173.9514 1191.0885 1242.5520 1260.8861 1263.0201 1298.9881 1323.8209 1329.5922 1342.7418 1352.2321 1380.7862 1436.6810 1451.3864 1458.6871 1469.6621 1473.2622 1521.0699 1581.0829 2969.1842 2981.8284 2985.9650 2992.8117 3027.5286 3048.6196 3054.5002 3062.3043
redmass: 7.2482 3.6142 3.0036 7.6005 7.5653 23.4462 10.8877 3.6138 7.6317 2.0214 6.6497 7.1448 5.1015 9.7371 7.1265 4.1833 3.3039 4.3579 11.8318 11.0837 5.8048 8.2775 3.9073 9.1631 11.7550 5.7047 1.4895 3.1181 1.4935 4.2368 2.6317 3.2345 1.8945 2.2624 2.8370 1.1579 1.7172 3.3103 7.8718 1.2783 1.3855 4.3795 5.8029 1.9776 1.3890 1.5033 1.5501 5.9686 6.5409 1.2056 1.0915 1.0882 1.0924 10.7119 6.4043 1.0635 1.0676 1.0630 1.0624 1.0949 1.0938 1.0992 1.1037
irintensity: 0.1878 0.0311 0.5142 0.4660 0.0818 0.1982 0.0202 1.0253 2.4471 0.8903 1.6726 3.9941 6.8752 2.1272 2.9967 1.3221 2.1794 6.9966 3.0791 0.2651 1.6759 1.4172 76.4169 7.1194 69.2669 63.6442 8.9898 8.4908 1.4478 2.8659 4.9291 12.6428 1.5776 8.6607 55.2636 2.7853 4.6982 32.2041 124.0845 2.9986 2.8444 51.4577 36.3454 57.7460 11.4396 33.2036 5.8860 159.5608 226.0379 11.0152 26.6289 12.1686 7.6996 61.7202 66.3454 19.5299 11.1007 32.5299 30.2512 23.2050 19.6295 45.1025 51.9595
temp: 298.150 k
press: 1.00000 atm
elementType: 17 17 16 7 7 6 6 6 6 6 6 6 6 6 6 1 1 1 1 1 1 1 1
symmnumber: 1
zpe: 421064.0 jmol-1
zpe.correction: 0.160375 hartree
zpe.thermalcorrener: 0.173241 hartree
zpe.thermalcorrenthalpy: 0.174185 hartree
zpe.thermalcorrgfe: 0.120066 hartree
zpe.sumelectzpe: -1812.476271 hartree
zpe.sumelectthermal: -1812.463405 hartree
zpe.sumelectthermalent: -1812.462461 hartree
zpe.sumelectthermalfe: -1812.516580 hartree
dipole: 6.5462 -0.2050 0.0436
dipole: 6.5496
quadrupole: -106.0157 -112.6029 -107.3084
quadrupole: -0.7676 0.0251 0.1486
quadrupole: 2.6267 -3.9606 1.3339 -0.7676 0.0251 0.1486
hfenergy: -1812.6366458 hartree
pointgroup: C01 [X(C10H8Cl2N2S1)]
dipole: -2.5754193 -0.0803315 -0.026377 debye
dipolederiv: -0.1693919 0.1975384 0.0100913 0.1407457 -0.8832954 -0.0360097 0.0009572 -0.0369514 -0.0682896 -1.0336412 0.1171223 0.0027552 0.1713144 -0.1059534 -0.0015993 0.0009179 -0.0016248 -0.0497519 -0.4207158 -0.0262422 0.008274 -0.1446137 -0.1700132 -0.0052254 0.0011582 -0.0058822 0.0962882 -1.1035322 0.0399275 0.0041895 -0.2939488 -0.4799571 -0.0124713 -0.0091255 -0.0089025 -0.1123117 -1.0945921 0.4478586 0.0176212 0.4317253 -0.7460148 -0.0227569 0.0152387 -0.02888 -0.0949431 0.0526098 -0.0519985 -0.0013477 -0.0210709 -0.0119877 0.0152794 0.0073856 0.0044814 0.1494537 0.0995375 -0.0442279 -0.0103754 -0.0073335 0.053724 0.0278715 0.047497 0.0124765 0.1383252 -0.3645043 -0.1755452 -0.0135875 -0.3797548 -0.0755553 -0.0089257 -0.0559821 0.0216456 -0.0436465 0.0911131 0.0014416 0.0269071 -0.1329198 0.0426493 0.0216691 -0.0418072 0.0353225 0.1330562 -0.0773733 0.0396361 0.0164132 0.0479556 -0.0319282 -0.010851 -0.0530433 -0.0406963 0.171444 0.4790755 -0.2140982 -0.0027805 0.1105073 0.3434225 0.0124762 0.0725172 0.0183896 -0.1793621 0.2364296 0.219437 0.0092737 -0.1879224 -0.8804205 -0.0279281 -0.003524 -0.0266617 0.1193448 0.5945127 0.0684224 -0.0068398 0.6290346 0.5955575 0.0152156 0.017695 0.017396 -0.0405811 0.7593346 -0.3463203 -0.0161975 -0.2144221 1.5553082 0.0705837 -0.0090742 0.0692387 0.0368757 2.0690343 -0.2842011 -0.0100245 -0.2746328 0.7714432 0.0241209 -0.0076946 0.0255991 0.0200406 0.0242557 0.0444894 -0.0144229 0.0539221 0.0100096 -0.061264 -0.0171366 -0.0895125 -0.0785535 0.031518 -0.037555 0.0528645 0.0035642 -0.0206916 0.0683378 0.0451212 0.0750043 0.0210305 -0.0697861 0.110629 0.0130173 0.1509961 -0.0958305 -0.0153695 0.0398741 -0.0363658 0.0785997 0.0529146 -0.0189771 0.0055229 -0.0635949 0.0580593 -0.0574519 -0.0431362 -0.0004292 -0.1657326 -0.2341202 -0.0474504 -0.0147682 -0.0349158 0.0479928 -0.0045524 -0.0413476 -0.0115127 0.080709 0.1016193 0.0056303 -0.0451621 0.0342246 0.0239834 -0.0334405 0.0298734 -0.0174818 -0.1600641 -0.0498514 -0.0422607 -0.0328515 -0.0021997 0.0612021 -0.0496195 -0.0543197 -0.0910314 -0.0807066 0.0255538 -0.0032561 0.0014276 -0.0166608 -0.0617042 0.0919109 0.0579555 0.1163787 0.0287752 unknown
polarizability: 236.0261184|3.3234797|168.7037812|0.5871941|2.7816522|73.5513517 unknown
InChI: InChI=1S/C10H8Cl2N2S/c11-8-7-5-3-1-2-4-6(5)15-9(7)14-10(12)13-8/h1-4H2
charge 0 multiplicity 1
23 atoms
Cl 0.863091 3.022011 0.138824
Cl 4.797893 -0.606157 -0.004524
S  -0.38065 -2.351911 -0.061131
N  2.213805 -1.374457 -0.031049
N  2.634978 1.00377 0.050448
C  -2.045853 1.455873 -0.009086
C  -3.503527 1.079988 -0.372001
C  -1.131347 0.240904 -0.012273
C  -3.970754 -0.189539 0.374976
C  -3.11192 -1.412936 -0.038201
C  -1.652216 -1.042301 -0.03672
C  0.321944 0.243392 0.005248
C  0.893132 -1.084326 -0.02811
C  1.320014 1.255922 0.053748
C  3.019986 -0.296106 0.002803
H  -2.015475 1.933512 0.990577
H  -1.666254 2.214478 -0.716413
H  -4.168493 1.931283 -0.137437
H  -3.579004 0.90403 -1.463698
H  -5.034647 -0.398368 0.160038
H  -3.881939 -0.029399 1.467047
H  -3.408799 -1.756635 -1.050666
H  -3.296965 -2.263128 0.645798
