program: Gaussian 09
title: 000290232
version: EM64L-G09RevD.01
frameworkgroup: C1[X(C8H9N3S)]
method: RPBEPBE
basis: SDD
operation: Freq
keyword: #pfreq=noraman
keyword: PBEPBE/SDD
title: #p freq=noraman PBEPBE/SDD
converged: NO NO NO NO
title: Mulliken charges:
elementType: S N N N C C C C C C C C H H H H H H H H H
charge: 0.292158 0.027236 -0.076193 -0.639419 0.450966 0.205439 -0.286756 -0.437848 0.114092 -0.847013 -0.769803 -0.392967 0.231899 0.231509 0.254536 0.240199 0.239045 0.239098 0.245340 0.336330 0.342151
chargesum: 0.00000
title: Mulliken charges with hydrogens summed into heavy atoms:
elementType: S N N N C C C C C C C C
charge: 0.292158 0.027236 -0.076193 0.039062 0.450966 0.205439 -0.286756 -0.437848 0.114092 -0.129068 -0.051461 -0.147627
polarizability: 1.71352735e+02 -1.62192436e+00 1.40491098e+02 8.38595184e-03 -3.45387414e-03 5.77301430e+01
1716.lowfreq: -48.3414 -3.0993 -0.0021 0.0003 0.0015 16.4867 17.1142 82.7412 119.7106
frequency: -48.2886 82.7281 119.6942 209.8326 221.2328 228.4248 232.7922 282.5012 324.2340 336.6070 413.1289 433.3556 457.2577 497.4875 502.4699 517.9346 546.5915 582.3170 611.2839 632.7856 688.1085 784.5440 784.6642 907.3037 923.6421 934.1837 984.6053 1020.6709 1044.0368 1053.2926 1092.1338 1171.9956 1216.4022 1256.6487 1306.3750 1345.4966 1375.4581 1395.1046 1404.6398 1421.5079 1465.6504 1466.7950 1479.6919 1490.1275 1504.9295 1544.5651 1581.7516 1618.3009 2956.6502 2972.1728 3029.7159 3047.1074 3082.3454 3086.7080 3168.4838 3544.4906 3703.4457
redmass: 1.0227 3.5927 3.6205 1.6429 2.6504 3.3170 3.5712 2.6201 4.2742 3.5229 10.0838 1.1386 6.3597 4.1433 8.0197 4.2693 1.1984 6.3707 4.8383 5.1746 3.8987 6.2853 9.8317 2.5264 1.4325 5.4491 2.1661 1.3600 1.4959 1.8542 2.0062 4.8726 5.0402 3.4095 11.1385 2.1040 5.9674 1.3096 1.1939 2.1737 1.1376 1.0448 1.4075 1.0456 2.7380 4.5614 5.6446 1.4186 1.0392 1.0383 1.0989 1.0982 1.0947 1.0963 1.0922 1.0455 1.1035
irintensity: 0.1312 1.2103 0.3339 4.6432 3.4540 1.2904 1.7932 0.1050 0.2071 7.7040 0.3224 158.6212 1.9421 10.6023 0.9202 1.4387 87.3461 5.7711 1.3956 25.4929 3.3146 15.3509 3.8333 1.6865 10.2469 28.5036 0.9610 4.8673 0.2716 18.7125 17.1590 18.7969 0.3414 13.2570 46.0927 35.3688 37.9810 8.9086 11.7935 12.8183 17.5187 25.5833 50.3208 1.9161 73.5947 183.6416 13.5728 344.5519 31.6124 30.5309 20.0265 17.0513 16.3728 10.5746 19.3359 78.8777 44.6019
temp: 298.150 k
press: 1.00000 atm
elementType: 16 7 7 7 6 6 6 6 6 6 6 6 1 1 1 1 1 1 1 1 1
symmnumber: 1
zpe: 419209.8 jmol-1
zpe.correction: 0.159669 hartree
zpe.thermalcorrener: 0.170157 hartree
zpe.thermalcorrenthalpy: 0.171101 hartree
zpe.thermalcorrgfe: 0.123934 hartree
zpe.sumelectzpe: -871.713435 hartree
zpe.sumelectthermal: -871.702946 hartree
zpe.sumelectthermalent: -871.702002 hartree
zpe.sumelectthermalfe: -871.749170 hartree
dipole: 2.6140 5.2913 0.0078
dipole: 5.9018
quadrupole: -73.0845 -72.6378 -80.7542
quadrupole: -2.3762 -0.0148 0.0207
quadrupole: 2.4077 2.8544 -5.2620 -2.3762 -0.0148 0.0207
hfenergy: -871.8731036 hartree
pointgroup: C01 [X(C8H9N3S1)]
dipole: -1.284734 -1.9341367 0.0028009 debye
dipolederiv: -0.4007805 -0.0295325 -0.0000448 0.1388147 -0.1465708 -0.0000473 0.000181 -0.0001186 0.0846002 -1.0343464 0.0090181 -0.0001154 0.0149966 -0.5616245 -0.0000118 -0.0000005 -0.0002703 -0.1742339 -0.4193275 -0.3778664 -0.0002647 0.2541428 -0.9189897 -0.0004144 -0.000425 0.0001542 -0.2409117 -0.2045917 0.0980109 -0.0007574 0.3806034 -1.4303633 -0.0014588 0.0004373 -0.0039209 -0.6719217 -0.2305423 0.0727346 -0.0000019 0.1810198 0.0109355 -0.0001042 -0.0000175 -0.0000046 -0.0507561 -0.1172726 0.2916949 0.0001639 0.2479974 -0.6880871 -0.0002619 0.0003613 -0.000314 0.0329221 0.2665544 0.1848988 0.0000797 0.0203869 0.3509371 0.0002354 -0.0005738 0.0004216 -0.1749013 0.8988454 -0.0913131 -0.000112 -0.2404768 0.3672199 0.000122 -0.0003157 0.0000721 -0.0589457 0.3524944 -0.0815844 0.00033 -0.3668964 1.7130213 0.001266 -0.0002979 0.0013362 0.1955736 -0.0048545 -0.0069719 0.0000882 -0.0212684 -0.0435515 -0.0001422 0.0002268 -0.0002377 0.1058922 -0.1095333 0.0059316 -0.0000837 -0.114543 0.0324204 0.0000059 0.000465 -0.0001558 0.0908456 0.6492884 0.0159009 0.0001611 -0.342919 0.7584846 0.0003419 0.0008912 0.0005337 -0.0511905 0.0853877 0.0640639 0.0840472 0.0019793 -0.0411991 -0.0673325 0.0579653 -0.0956946 -0.0396778 0.0849597 0.064474 -0.0843905 0.0022405 -0.0414329 0.0674536 -0.058326 0.0957898 -0.0396888 -0.1318224 -0.0829213 0.0001538 0.0241014 0.1025815 -0.0000106 0.0000551 0.0000105 0.105156 0.0773554 0.020782 -0.000062 0.1251588 -0.0784554 0.0003959 -0.0002477 0.0003224 0.1225394 -0.0364858 -0.0146124 -0.0382841 -0.0665899 0.0526029 -0.1024202 -0.0911293 -0.0743185 -0.0354098 -0.0368377 -0.0143889 0.038518 -0.0662348 0.053251 0.1020175 0.0914239 0.0739897 -0.036058 -0.0642164 -0.0785358 -0.0000432 -0.073031 0.0462851 -0.0000254 -0.0005675 -0.0002334 0.1257003 0.1984389 -0.0486723 -0.0000668 -0.0536105 0.2368664 0.0002051 -0.000545 0.0010329 0.3694059 0.1772868 -0.0011108 0.0006846 -0.0458721 0.2256687 0.0001859 0.0004392 0.0016052 0.3410601 unknown
polarizability: 170.4448893|-5.4611291|141.3989361|-0.0202188|0.0214245|57.7301509 unknown
InChI: InChI=1S/C8H9N3S/c1-4-5(2)12-8-6(4)7(9)10-3-11-8/h3H,9H2,1-2H3
charge 0 multiplicity 1
21 atoms
S  -1.295609 1.991919 0.000229
N  1.481654 1.86243 -0.000135
N  2.61211 -0.297489 -0.00056
N  1.505341 -2.341914 -0.001747
C  -1.227622 -0.690739 -0.000325
C  0.163676 -0.249348 -0.000287
C  -2.122447 0.370705 -0.000276
C  0.309455 1.173999 -0.000084
C  1.410781 -0.967216 -0.000539
C  -1.67472 -2.138741 -0.000463
C  -3.629979 0.32895 -0.000187
C  2.58613 1.065135 -0.000835
H  -1.315829 -2.677662 -0.900057
H  -1.314901 -2.678195 0.898485
H  -2.774709 -2.217783 0.000307
H  -4.064185 1.343059 -0.002012
H  -4.021854 -0.197632 -0.891607
H  -4.021886 -0.194449 0.893112
H  3.556433 1.569626 0.000363
H  2.443332 -2.739767 -0.001015
H  0.691627 -2.948888 0.001535
