program: Gaussian 09
title: 000290230
version: EM64L-G09RevD.01
frameworkgroup: C1[X(C11H12N2OS)]
method: RPBEPBE
basis: SDD
operation: Freq
keyword: #p
keyword: freq=noraman
keyword: PBEPBE/SDD
title: #p freq=noraman PBEPBE/SDD
converged: YES YES NO NO
title: Mulliken charges:
elementType: S O N N C C C C C C C C C C C H H H H H H H H H H H H
charge: 0.365116 -0.232645 -0.367824 -0.042246 -0.415061 -0.413314 -0.482979 -0.447554 0.465035 -0.438016 0.228214 -0.250002 -0.279670 0.222421 -0.794994 0.214407 0.209707 0.213726 0.213357 0.226672 0.233563 0.228510 0.230476 0.352713 0.245008 0.270616 0.244765
chargesum: 0.00000
title: Mulliken charges with hydrogens summed into heavy atoms:
elementType: S O N N C C C C C C C C C C C
charge: 0.365116 -0.232645 -0.015111 -0.042246 0.009053 0.013770 -0.022745 0.011432 0.465035 -0.438016 0.228214 -0.250002 -0.279670 0.222421 -0.034605
polarizability: 2.11062300e+02 -5.00739941e-02 1.76734062e+02 4.50137545e-02 1.18292675e+00 8.00387187e+01
1716.lowfreq: -66.7841 -8.0205 -0.0019 -0.0015 -0.0010 2.4787 7.5206 53.4379 74.5189
frequency: -66.7694 53.3922 74.5164 93.3453 95.4122 114.1995 119.5666 174.0886 230.4760 234.2516 280.9709 303.6640 324.4258 357.3929 401.6075 442.7019 469.8104 470.6514 512.9452 525.2010 537.2870 575.9012 582.9564 650.4640 677.5657 683.4559 734.8006 809.5435 821.7655 852.0691 903.1461 957.2187 959.3037 968.9789 998.2530 1020.8400 1033.2453 1081.6976 1095.8261 1135.6458 1160.1663 1175.3836 1228.8728 1240.0518 1256.6173 1300.3452 1322.0588 1328.4849 1343.7863 1348.4497 1382.7363 1397.8931 1425.9423 1455.6369 1459.3701 1462.8306 1466.5203 1470.0691 1474.9617 1544.1359 1597.6234 1626.6963 2152.7206 2965.2451 2969.9338 2984.5513 2987.9763 2991.2893 3021.3615 3025.8827 3048.6087 3057.0025 3075.7240 3138.3703 3489.3713
redmass: 1.0444 4.1004 5.7091 6.7934 3.8156 3.0461 5.5833 4.8964 3.7504 6.2137 2.7594 2.1932 3.5907 7.6413 5.8363 3.9648 7.9444 7.8821 4.3737 3.7591 3.6184 3.4665 4.0779 1.4238 5.5414 4.5378 3.9575 3.6399 1.4700 2.7877 1.4764 2.6789 2.5497 2.9918 2.8656 3.7218 1.6423 1.8670 1.8309 1.1510 1.8751 2.0693 2.9113 1.2876 1.2636 2.1311 2.3021 1.4258 1.4980 1.5278 1.2352 4.0941 2.0895 1.1235 1.2295 1.0827 1.0458 1.0914 1.0943 4.6643 6.8900 5.5597 12.6045 1.0630 1.0631 1.0647 1.0626 1.0385 1.0952 1.0961 1.0989 1.1043 1.0982 1.0982 1.0772
irintensity: 0.2817 0.4007 15.3396 10.5792 2.3058 0.0924 2.4123 0.6771 3.1363 5.0740 0.6378 0.5561 2.5952 0.0715 1.2336 0.9299 4.9519 2.8926 6.1749 8.5221 1.9527 1.0610 4.9143 69.5939 5.0055 13.3294 1.3832 1.9315 6.0653 5.8261 1.3088 3.3332 21.7296 2.8538 12.5418 17.2977 8.3667 0.0713 1.3709 2.0834 2.7730 2.1462 81.7270 1.7540 9.5655 95.2941 41.3467 9.4431 7.8257 4.6481 48.1558 47.2131 135.1124 3.1854 17.1824 13.5128 20.7996 12.3791 4.6720 323.7081 28.4278 100.2399 99.9164 32.1411 22.5042 34.1824 29.4223 5.1854 35.3448 13.6692 64.8391 58.9108 10.7896 5.5526 24.5761
temp: 298.150 k
press: 1.00000 atm
elementType: 16 8 7 7 6 6 6 6 6 6 6 6 6 6 6 1 1 1 1 1 1 1 1 1 1 1 1
symmnumber: 1
zpe: 548698.7 jmol-1
zpe.correction: 0.208988 hartree
zpe.thermalcorrener: 0.222838 hartree
zpe.thermalcorrenthalpy: 0.223782 hartree
zpe.thermalcorrgfe: 0.167940 hartree
zpe.sumelectzpe: -1008.069997 hartree
zpe.sumelectthermal: -1008.056148 hartree
zpe.sumelectthermalent: -1008.055203 hartree
zpe.sumelectthermalfe: -1008.111045 hartree
dipole: -0.8599 -0.6006 0.0100
dipole: 1.0490
quadrupole: -73.3280 -115.3051 -95.7859
quadrupole: 10.4159 0.1391 -0.2421
quadrupole: 21.4783 -20.4988 -0.9796 10.4159 0.1391 -0.2421
hfenergy: -1008.2789851 hartree
pointgroup: C01 [X(C11H12N2O1S1)]
dipole: 0.3306271 0.2469765 0.0028932 debye
polarizability: 211.0306336|1.0432922|176.7539906|-0.0118846|-1.5926277|80.0504559 unknown
InChI: InChI=1S/C11H12N2OS/c1-7(14)13-11-9(6-12)8-4-2-3-5-10(8)15-11/h13H,2-5H2,1H3
charge 0 multiplicity 1
27 atoms
S  -0.40707 1.758624 -0.047014
O  -3.241495 1.873472 -0.037191
N  -2.355196 -0.27618 0.000593
N  -0.416615 -3.443278 0.06101
C  3.869919 -0.058585 -0.362911
C  3.774694 1.306337 0.361581
C  2.691776 -0.989818 0.020422
C  2.490755 2.077365 -0.050937
C  1.373967 -0.23959 -0.002236
C  1.311737 1.13902 -0.03164
C  0.058169 -0.861859 0.013689
C  -1.000058 0.06248 -0.00728
C  -0.18354 -2.266293 0.040421
C  -3.432856 0.624365 -0.013556
C  -4.804533 -0.033727 0.002881
H  4.828106 -0.554105 -0.119367
H  3.862949 0.112408 -1.457893
H  4.662622 1.924627 0.132908
H  3.764684 1.138831 1.456481
H  2.8579 -1.409229 1.033925
H  2.64735 -1.857007 -0.666349
H  2.621743 2.506746 -1.065768
H  2.328228 2.933211 0.632352
H  -2.562457 -1.280603 0.021001
H  -4.948436 -0.682639 -0.880581
H  -5.572908 0.752145 -0.006542
H  -4.940832 -0.65382 0.907999
