program: Gaussian 09
title: 000290221
version: EM64L-G09RevD.01
frameworkgroup: C1[X(C16H14N2OS)]
method: RPBEPBE
basis: SDD
operation: Freq
keyword: #p
keyword: freq=noraman
keyword: PBEPBE/SDD
title: #p freq=noraman PBEPBE/SDD
converged: YES YES NO NO
title: Mulliken charges:
elementType: S O N N C C C C C C C C C C C C C C C C H H H H H H H H H H H H H H
charge: 0.266503 -0.212134 -0.419677 -0.035798 -0.417472 -0.413024 -0.486589 -0.446218 0.437143 -0.411769 0.313979 -0.298447 -0.219226 0.138481 0.278136 -0.342233 -0.365926 -0.222381 -0.230989 -0.224419 0.211923 0.215408 0.213190 0.214263 0.242896 0.226876 0.229307 0.230919 0.318674 0.273944 0.231529 0.235373 0.232690 0.235067
chargesum: 0.00000
title: Mulliken charges with hydrogens summed into heavy atoms:
elementType: S O N N C C C C C C C C C C C C C C C C
charge: 0.266503 -0.212134 -0.101002 -0.035798 0.009859 0.014429 -0.016818 0.014008 0.437143 -0.411769 0.313979 -0.298447 -0.219226 0.138481 0.278136 -0.068288 -0.134397 0.012992 0.001701 0.010648
polarizability: 3.14139833e+02 3.67058146e+00 1.76302128e+02 -3.74993336e+00 4.71911017e+00 1.42878672e+02
1716.lowfreq: -10.2222 -3.7971 -0.0017 -0.0016 -0.0005 5.7383 22.7768 28.9365 37.1312
frequency: 22.1159 28.9195 37.0231 71.3292 91.9751 95.8775 109.2928 136.6773 153.7307 173.9419 227.2510 259.1279 274.9355 294.2394 323.8259 368.0827 392.5534 403.1737 407.3352 438.0312 458.2096 465.6385 478.5182 514.9128 536.8153 556.6615 575.9447 601.4520 614.4048 664.5432 681.6413 690.0249 703.5549 759.7485 791.0971 810.4532 820.9897 844.9748 856.7233 901.4786 912.9115 937.8365 958.1202 965.6304 984.6826 989.9102 1006.1805 1007.2295 1021.6254 1056.1466 1080.8935 1088.7437 1095.8150 1135.2995 1151.9402 1171.4968 1175.1266 1191.0750 1239.0020 1241.9119 1248.7716 1257.5662 1310.9832 1319.3858 1326.7148 1342.4196 1347.5521 1385.3157 1394.7032 1429.4825 1443.3780 1454.1846 1461.5890 1470.1484 1474.2919 1480.1486 1543.0507 1583.0430 1594.2610 1610.1103 1624.6904 2178.0006 2966.7972 2971.9319 2987.0032 2988.8233 3021.9516 3031.5717 3050.5969 3058.6017 3121.1852 3134.5762 3147.4727 3159.7535 3171.4768 3525.3545
redmass: 5.1772 5.6895 4.9887 6.9242 3.2242 4.6184 7.8070 5.0153 4.4656 5.8418 4.1509 5.0746 5.4012 1.8668 4.4654 5.8784 5.1339 2.9180 5.2230 4.3077 8.5283 8.3729 4.3647 4.8806 3.2524 2.1662 2.0467 4.7201 6.0844 6.3843 5.8383 5.7323 1.5718 3.5416 2.3745 4.9976 1.4852 2.8123 1.2568 1.5637 4.2929 1.5134 2.5651 5.0516 1.5082 4.4083 1.4144 2.9948 2.8485 2.6710 1.8623 1.6724 1.8273 1.1771 2.1440 1.7000 1.0595 1.1173 1.3702 2.9355 2.1210 1.6278 1.7655 1.3406 1.3651 1.4179 1.5267 9.1272 5.0301 2.0633 1.9968 1.1335 1.0815 1.0875 1.0950 2.2606 6.6740 6.1229 6.7391 5.9862 7.9548 12.6197 1.0626 1.0642 1.0653 1.0617 1.0954 1.0955 1.0991 1.1043 1.0874 1.0873 1.0919 1.0959 1.1009 1.0762
irintensity: 1.3337 1.4511 0.9687 3.6625 0.2993 0.8522 2.4151 5.2362 1.9992 1.4718 1.1203 3.0404 5.5203 0.8746 3.3382 1.2472 1.3192 0.4283 1.3753 4.4187 3.8207 2.8677 5.8053 2.2751 0.4682 47.4444 54.7380 9.7244 1.5507 4.8649 7.4580 11.1968 88.5572 7.9875 22.0145 20.2374 5.8256 7.6021 2.5232 0.7727 12.8317 0.9254 4.8999 2.4296 2.3967 0.5358 0.4797 7.3483 31.3453 41.8588 0.6205 7.9084 6.0438 3.9256 33.3492 2.7928 1.3011 17.8096 37.8007 202.9993 36.2691 13.0842 2.7200 2.1759 2.9974 2.1296 1.3745 0.6763 15.7784 153.9178 343.1491 1.0702 15.4769 12.1089 6.1215 15.6575 22.8606 21.5014 20.6497 6.7173 87.5588 34.1056 30.6517 18.4768 37.3410 28.6072 31.8284 12.3293 65.5942 55.8645 11.3354 2.0033 19.0944 15.6641 22.7392 15.6238
temp: 298.150 k
press: 1.00000 atm
elementType: 16 8 7 7 6 6 6 6 6 6 6 6 6 6 6 6 6 6 6 6 1 1 1 1 1 1 1 1 1 1 1 1 1 1
symmnumber: 1
zpe: 685853.1 jmol-1
zpe.correction: 0.261228 hartree
zpe.thermalcorrener: 0.278969 hartree
zpe.thermalcorrenthalpy: 0.279913 hartree
zpe.thermalcorrgfe: 0.213511 hartree
zpe.sumelectzpe: -1199.481361 hartree
zpe.sumelectthermal: -1199.463619 hartree
zpe.sumelectthermalent: -1199.462675 hartree
zpe.sumelectthermalfe: -1199.529078 hartree
dipole: -0.7442 -5.1941 -1.5810
dipole: 5.4801
quadrupole: -83.4680 -137.2884 -121.8062
quadrupole: -3.8794 -3.7705 4.0218
quadrupole: 30.7195 -23.1009 -7.6186 -3.8794 -3.7705 4.0218
hfenergy: -1199.7425885 hartree
pointgroup: C01 [X(C16H14N2O1S1)]
dipole: 0.2489251 2.1316612 -0.2063715 debye
polarizability: 313.895092|5.7561829|177.0123007|5.4338915|2.2208196|142.4132395 unknown
InChI: InChI=1S/C16H14N2OS/c17-10-13-12-8-4-5-9-14(12)20-16(13)18-15(19)11-6-2-1-3-7-11/h1-3,6-7,18H,4-5,8-9H2
charge 0 multiplicity 1
34 atoms
S  1.596553 2.141592 0.477495
O  -1.209063 -0.999733 1.258962
N  -0.762821 0.793376 -0.187276
N  0.634645 -2.659786 -1.349809
C  5.308644 -0.634377 0.332413
C  5.591981 0.855505 0.02156
C  3.994147 -1.112331 -0.333156
C  4.48245 1.773588 0.605108
C  2.878471 -0.106407 -0.125987
C  3.127955 1.183622 0.30524
C  1.468061 -0.368595 -0.375472
C  0.635071 0.723531 -0.118572
C  0.992218 -1.613208 -0.892334
C  -1.635858 -0.103566 0.482634
C  -3.096684 0.12131 0.207759
C  -4.022388 -0.329729 1.183869
C  -3.578139 0.723813 -0.984806
C  -5.406701 -0.15431 0.985483
C  -4.965945 0.892942 -1.184073
C  -5.882104 0.462331 -0.196768
H  5.235131 -0.76722 1.430084
H  6.149597 -1.263041 -0.014163
H  5.644238 0.99599 -1.075929
H  6.571142 1.156877 0.437672
H  3.691431 -2.096103 0.07328
H  4.15431 -1.266325 -1.41989
H  4.571381 2.793349 0.183132
H  4.618317 1.87434 1.701575
H  -1.184682 1.607706 -0.639353
H  -3.632838 -0.820307 2.081774
H  -2.886415 1.014035 -1.785089
H  -6.114897 -0.500182 1.746002
H  -5.331932 1.345223 -2.112099
H  -6.958376 0.594094 -0.353367
