program: Gaussian 09
title: 000290215
version: EM64L-G09RevD.01
frameworkgroup: C1[X(C10H13NO3S)]
method: RPBEPBE
basis: SDD
operation: Freq
keyword: #p
keyword: freq=noraman
keyword: PBEPBE/SDD
title: #p freq=noraman PBEPBE/SDD
converged: YES YES NO NO
title: Mulliken charges:
elementType: S O O O N C C C C C C C C C C H H H H H H H H H H H H H
charge: 0.388732 -0.378210 -0.253594 -0.236550 -0.361727 0.108907 0.527371 -0.275716 -0.761980 -0.769604 0.234890 -0.251672 0.209412 -0.658195 -0.790206 0.275128 0.243522 0.241865 0.213409 0.391474 0.245252 0.215553 0.219603 0.254988 0.219472 0.239676 0.267269 0.240930
chargesum: 0.00000
title: Mulliken charges with hydrogens summed into heavy atoms:
elementType: S O O O N C C C C C C C C C C
charge: 0.388732 -0.378210 -0.253594 -0.236550 0.029747 0.108907 0.527371 -0.275716 -0.486852 -0.070808 0.234890 0.209134 0.209412 0.035868 -0.042332
polarizability: 1.89128294e+02 -8.39530010e+00 1.86190518e+02 5.03512207e+00 3.33126613e+00 7.71458446e+01
1716.lowfreq: -71.3017 -7.6761 -4.7507 -0.0016 -0.0009 0.0019 7.3796 41.6201 53.4278
frequency: -71.2990 41.5770 53.4147 77.5992 79.3202 101.2362 115.6501 149.4975 167.4432 177.2752 219.0374 242.9958 266.3454 268.9341 307.2873 323.7331 331.4499 381.8403 419.3210 472.1134 511.3963 531.8382 545.2290 580.8001 618.2202 689.5225 694.0161 729.3832 745.3759 781.6203 792.7686 819.1445 834.5423 835.8446 930.9700 974.1369 996.3953 1012.8401 1028.6942 1032.8764 1043.8505 1096.2104 1124.7910 1152.7794 1186.0615 1230.0336 1280.7089 1324.0365 1354.1922 1378.5704 1382.2508 1392.1940 1404.8537 1431.6629 1453.5698 1455.9700 1456.8210 1458.6983 1463.2544 1465.2211 1483.9669 1539.4272 1565.5065 1619.6344 1627.0390 2990.7168 2992.6427 2992.7638 3032.2729 3075.5018 3079.6832 3085.5534 3094.0635 3094.4820 3117.9999 3137.1780 3227.0638 3315.8727
redmass: 1.0363 3.3442 4.2063 4.4824 4.6626 5.5528 3.4818 3.3990 2.6156 1.1789 1.4344 4.3969 3.9986 4.9683 4.7697 4.0033 3.4728 6.6525 4.2369 4.5441 4.2159 6.6123 4.2741 3.2663 6.6946 4.3405 5.8448 2.0748 2.2442 4.2052 1.9973 2.2235 1.8271 1.7725 3.8699 2.0948 2.4869 1.6787 3.7410 1.6526 1.5030 2.1987 3.2026 1.6508 1.6775 3.1351 1.1165 3.2296 1.4160 1.4450 2.8212 1.2321 1.2415 2.2843 1.1573 1.0448 1.0952 1.2735 1.0615 1.0466 1.0517 3.2657 5.0613 5.0950 9.9148 1.0382 1.0362 1.0359 1.0587 1.0982 1.0972 1.0993 1.1022 1.1009 1.1058 1.0983 1.0959 1.0793
irintensity: 0.4138 0.8120 0.0327 8.6239 0.2483 2.8563 5.6412 1.0578 5.8947 0.4193 0.7785 3.4848 2.2419 1.4917 1.0044 2.4181 13.2087 2.8723 3.8261 3.6521 0.2807 5.5934 6.1573 3.9745 5.5053 4.5732 4.4671 34.1304 14.3445 1.3989 20.1070 11.1547 41.1326 56.0643 102.4141 38.4161 8.6940 23.7993 251.6226 8.4073 9.2366 20.4761 32.7371 11.1869 38.1473 77.0480 3.1585 169.6545 4.1068 4.1926 269.1963 32.0804 26.0333 107.4836 26.3187 14.4622 22.1654 7.5264 20.1300 19.8005 15.0937 486.3193 136.1831 140.3908 233.4288 6.2943 22.8652 22.1506 35.0374 12.6100 13.1437 29.7538 12.0232 21.4058 24.6449 7.5835 0.8815 217.9933
temp: 298.150 k
press: 1.00000 atm
elementType: 16 8 8 8 7 6 6 6 6 6 6 6 6 6 6 1 1 1 1 1 1 1 1 1 1 1 1 1
symmnumber: 1
zpe: 565168.4 jmol-1
zpe.correction: 0.215261 hartree
zpe.thermalcorrener: 0.230838 hartree
zpe.thermalcorrenthalpy: 0.231782 hartree
zpe.thermalcorrgfe: 0.171759 hartree
zpe.sumelectzpe: -1066.239278 hartree
zpe.sumelectthermal: -1066.223702 hartree
zpe.sumelectthermalent: -1066.222758 hartree
zpe.sumelectthermalfe: -1066.282780 hartree
dipole: -2.6673 -3.0921 -0.1580
dipole: 4.0866
quadrupole: -109.5638 -76.7945 -96.8096
quadrupole: 7.4593 -1.1582 1.8247
quadrupole: -15.1745 17.5948 -2.4203 7.4593 -1.1582 1.8247
hfenergy: -1066.4545397 hartree
pointgroup: C01 [X(C10H13N1O3S1)]
dipole: -0.1983158 1.5864733 0.1697958 debye
polarizability: 195.9130398|1.2843066|177.9488007|3.7743085|13.1125187|78.6028157 unknown
InChI: InChI=1S/C10H13NO3S/c1-4-14-10(13)8-6(2)5-15-9(8)11-7(3)12/h5,11H,4H2,1-3H3
charge 0 multiplicity 1
28 atoms
S  1.225941 -2.470889 -0.227982
O  -0.545065 1.738976 0.470113
O  -2.669741 0.786996 0.279416
O  3.596257 -0.976197 0.073028
N  1.624899 0.254601 0.246212
C  -0.700233 -0.634696 0.058241
C  -1.394763 -1.905143 -0.169936
C  0.70719 -0.773127 0.055731
C  -0.514394 -2.95278 -0.337011
C  -2.895603 -2.077667 -0.220906
C  -1.424343 0.624911 0.264223
C  -1.202623 3.066826 0.664362
C  3.019962 0.135862 0.252772
C  -1.489552 3.738464 -0.681062
C  3.756943 1.446027 0.494235
H  -0.747717 -4.000433 -0.519682
H  -3.368942 -1.747632 0.720083
H  -3.343152 -1.462757 -1.021178
H  -3.154572 -3.13559 -0.398463
H  1.167745 1.171736 0.393905
H  -2.13027 2.907898 1.23989
H  -0.476271 3.635549 1.268403
H  -0.56729 3.848395 -1.277841
H  -2.222079 3.152003 -1.259963
H  -1.913019 4.745832 -0.511128
H  3.511159 2.191202 -0.28458
H  4.839052 1.253577 0.474093
H  3.48858 1.877255 1.476228
