program: Gaussian 09
title: 000290206
version: EM64L-G09RevD.01
frameworkgroup: C1[X(C19H25N5O)]
method: RPBEPBE
basis: SDD
operation: Freq
keyword: #p
keyword: freq=noraman
keyword: PBEPBE/SDD
title: #p freq=noraman PBEPBE/SDD
converged: YES YES NO NO
title: Mulliken charges:
elementType: O N N N N N C C C C C C C C C C C C C C C C C C C H H H H H H H H H H H H H H H H H H H H H H H H H
charge: -0.435399 -0.259960 -0.399336 -0.471647 -0.038325 -0.112234 -0.506625 0.377518 -0.029440 -0.309329 -0.306088 0.179628 0.210673 0.024742 0.111680 0.471347 -0.564796 0.081416 -0.485579 -0.682099 -0.674364 -0.832517 -0.336640 -0.790919 -0.386396 0.237204 0.232358 0.206563 0.246099 0.205384 0.212157 0.325201 0.319003 0.333921 0.213922 0.245906 0.205799 0.220064 0.234916 0.219209 0.217084 0.229116 0.230651 0.230376 0.242618 0.239681 0.239561 0.238129 0.237671 0.402098
chargesum: 0.00000
title: Mulliken charges with hydrogens summed into heavy atoms:
elementType: O N N N N N C C C C C C C C C C C C C C C C C C C
charge: -0.033301 -0.259960 -0.080333 -0.137727 -0.038325 -0.112234 -0.037063 0.377518 -0.029440 0.143332 0.111452 0.179628 0.210673 0.024742 0.111680 0.471347 -0.239596 0.081416 -0.271658 -0.010330 -0.003155 -0.142374 -0.094022 -0.073548 -0.148725
polarizability: 4.32966938e+02 -1.06870112e+01 2.57883321e+02 1.00797176e+01 1.41290148e+00 1.45269908e+02
1716.lowfreq: -5.8509 -5.2350 0.0003 0.0005 0.0008 3.6559 17.0206 24.5980 45.3531
frequency: 16.8743 24.4817 45.3172 49.3840 64.3593 74.0421 83.3922 85.6117 99.3243 121.1105 130.6325 138.1016 165.9146 183.6708 196.2713 201.1159 238.9771 240.8873 252.1128 269.7545 284.2289 284.8058 291.3480 299.5948 333.4663 340.1815 372.9386 388.1608 436.8884 447.2201 464.9464 481.0185 488.8619 507.5078 548.2359 561.6854 571.2702 580.3847 587.6946 602.9927 636.7473 641.1643 657.5111 660.8200 730.4799 733.5511 749.5518 753.9314 782.3514 787.3033 795.2670 812.2218 814.9629 828.0104 869.7465 904.0934 918.0875 928.1477 932.1069 942.9422 972.5713 981.0958 999.3594 1028.1152 1035.9551 1046.2007 1049.3359 1064.8116 1070.6131 1074.4860 1110.0018 1117.7708 1137.4117 1152.3101 1162.1296 1180.1371 1193.6546 1196.3118 1211.8607 1230.6820 1249.9437 1258.9519 1275.4750 1284.3091 1291.2961 1313.3906 1337.9923 1345.5940 1354.5608 1361.7118 1363.2007 1368.5142 1394.7096 1396.7398 1398.0176 1399.2545 1410.5927 1433.2249 1441.1114 1451.2731 1457.5106 1466.8378 1467.4346 1472.2236 1472.5839 1475.0855 1477.9537 1481.0521 1482.1640 1483.4194 1486.4867 1488.2168 1498.3438 1528.4638 1536.6145 1586.1831 1604.5934 1614.3809 1631.5068 2343.6731 2918.9129 2931.1360 2946.4216 2955.1497 2969.2941 2986.9436 2989.6616 3018.9862 3023.0383 3037.9252 3041.5443 3049.2118 3076.4406 3080.2090 3084.9937 3093.3885 3093.9815 3098.2402 3102.3816 3155.7415 3159.2127 3165.5049 3549.2325 3597.4605
redmass: 4.5774 3.6521 3.8796 3.9314 3.5349 2.0659 1.2925 1.9427 3.4150 3.4600 3.7735 2.3126 3.2868 1.0673 1.3962 2.6501 4.1138 3.3132 2.3037 3.3722 2.5791 4.9501 2.0114 2.9940 3.5212 4.2687 4.8848 3.1990 3.4136 3.5695 3.3444 5.8869 3.3393 4.9700 3.1630 3.9320 2.6678 6.5658 1.1536 1.5070 5.4351 4.5191 5.7097 6.0753 3.5209 6.4793 4.0372 2.9891 3.6510 9.6651 1.1709 1.3754 1.5651 3.4113 5.9889 1.9447 1.4241 3.4596 1.3968 1.3840 1.4846 2.3230 1.9231 2.2578 1.3992 1.5033 2.5100 3.8856 2.5001 1.5935 1.9623 2.0422 3.5023 1.6859 1.6984 1.4692 1.8430 3.5069 1.6421 1.8400 1.6221 2.3345 1.6287 1.2699 1.1942 4.8949 3.7860 1.7097 2.0761 1.3028 2.3862 2.0168 1.6612 1.2262 1.2249 1.5785 1.2756 3.7725 4.5200 1.1964 2.4906 1.0791 1.0450 1.1370 1.1548 1.0909 1.2362 1.0455 1.2660 1.1544 1.3409 1.0845 2.4077 2.4685 5.7594 2.5115 4.4328 3.0261 5.3654 1.0715 1.0707 1.0689 1.0646 1.0396 1.0394 1.0362 1.0363 1.0959 1.0988 1.0982 1.0927 1.0908 1.0936 1.0984 1.0983 1.1007 1.1008 1.0947 1.0897 1.0917 1.0929 1.0942 1.0752 1.0807
irintensity: 2.5456 0.4535 2.0618 0.1964 0.6800 0.5768 0.4727 0.4248 1.3311 2.4082 0.4631 0.9702 1.5257 1.7846 0.3988 1.1707 1.5148 4.1323 1.6831 2.8904 0.0174 0.1850 1.8389 0.9702 5.9794 1.2751 1.9247 21.6737 3.8819 2.0079 7.4774 9.1573 18.7795 13.8716 1.1922 5.1626 19.8570 20.8097 123.7114 19.3964 12.2379 0.6532 4.0042 7.3252 6.6116 1.2605 9.4935 17.7654 35.7779 6.9688 7.2153 9.0264 49.5360 0.8217 27.8888 17.7127 13.0670 1.1957 0.7278 12.8507 0.2167 5.7143 27.8205 13.2351 4.2222 0.1938 44.0021 24.3888 23.9817 15.0996 16.7672 18.7215 2.5764 4.1120 14.5594 36.6090 51.4019 16.7903 32.7421 15.2009 64.6329 110.9178 27.9301 9.0416 17.9730 56.5073 4.2041 19.6029 42.6794 3.6722 24.6089 40.8542 15.1324 39.8565 20.1882 21.0606 29.8543 57.5001 26.3768 4.4522 63.7594 12.7701 8.9376 112.8273 11.5072 15.4206 70.6265 17.4222 40.3161 18.1282 293.3848 11.8182 179.3442 211.3553 187.9500 557.8631 19.0503 100.8520 58.5500 1641.5396 29.7407 46.0352 50.7902 35.9971 76.4237 28.8399 19.5585 17.1467 20.9923 20.9155 4.4092 11.6667 33.1586 34.4123 69.1843 31.8414 29.7624 15.0853 22.0483 22.7644 11.8242 14.8254 23.8714 74.1255
temp: 298.150 k
press: 1.00000 atm
elementType: 8 7 7 7 7 7 6 6 6 6 6 6 6 6 6 6 6 6 6 6 6 6 6 6 6 1 1 1 1 1 1 1 1 1 1 1 1 1 1 1 1 1 1 1 1 1 1 1 1 1
symmnumber: 1
zpe: 1087155.4 jmol-1
zpe.correction: 0.414076 hartree
zpe.thermalcorrener: 0.438714 hartree
zpe.thermalcorrenthalpy: 0.439658 hartree
zpe.thermalcorrgfe: 0.358507 hartree
zpe.sumelectzpe: -1086.183747 hartree
zpe.sumelectthermal: -1086.159109 hartree
zpe.sumelectthermalent: -1086.158164 hartree
zpe.sumelectthermalfe: -1086.239315 hartree
dipole: 1.7912 0.0984 1.0373
dipole: 2.0722
quadrupole: -102.3516 -151.1431 -151.9405
quadrupole: 28.5478 -1.5820 1.7593
quadrupole: 32.7935 -15.9980 -16.7954 28.5478 -1.5820 1.7593
hfenergy: -1086.5978225 hartree
pointgroup: C01 [X(C19H25N5O1)]
dipole: 0.7363387 0.048195 -0.3466271 debye
polarizability: 432.9665366|-5.4910371|241.7597772|16.0004489|38.5682638|161.3938529 unknown
InChI: InChI=1S/C19H25N5O/c1-5-24(6-2)10-14-9-15(7-8-16(14)25)23-19-17-12(3)13(4)22-18(17)20-11-21-19/h7-9,11,22-23,25H,5-6,10H2,1-4H3
charge 0 multiplicity 1
50 atoms
O  -4.298003 -1.426664 -0.469887
N  -4.592432 1.101528 -0.096775
N  5.674308 0.769853 0.845459
N  1.311937 -0.843103 0.048841
N  3.838173 2.30356 1.378543
N  1.620483 1.361235 0.927385
C  -3.344876 1.012396 0.749005
C  -2.388312 -0.053574 0.230032
C  3.575689 -0.009219 0.462289
C  -4.301532 1.745399 -1.423394
C  -5.719805 1.764372 0.632315
C  4.518247 -1.052116 0.08916
C  5.801653 -0.539477 0.337478
C  4.333472 1.110934 0.929257
C  2.148157 0.174053 0.480847
C  -0.108431 -0.923284 -0.040413
C  -0.993381 0.115033 0.35016
C  -2.925198 -1.263542 -0.31246
C  -0.651966 -2.133333 -0.556782
C  -5.334137 1.37833 -2.503914
C  -6.395381 0.841178 1.663529
C  4.197861 -2.42327 -0.458079
C  -2.040837 -2.299922 -0.697463
C  7.162319 -1.147795 0.151387
C  2.479322 2.343352 1.344299
H  -3.672267 0.740594 1.770953
H  -2.83876 1.999774 0.81581
H  -4.233038 2.850158 -1.300869
H  -3.304611 1.390317 -1.740773
H  -5.356965 2.696185 1.12439
H  -6.467906 2.068758 -0.120369
H  -0.564394 1.036662 0.751196
H  6.437815 1.387649 1.11631
H  1.796405 -1.684249 -0.267716
H  0.019537 -2.948482 -0.859748
H  -5.372936 0.283593 -2.642273
H  -6.350492 1.734414 -2.255747
H  -5.047962 1.838759 -3.466963
H  -6.778781 -0.072488 1.176795
H  -5.70282 0.531956 2.466192
H  -7.243655 1.365478 2.14006
H  5.114961 -3.008442 -0.642209
H  3.581319 -3.017508 0.245794
H  3.659061 -2.369818 -1.425384
H  -2.461935 -3.224054 -1.104564
H  7.779651 -0.56486 -0.55951
H  7.720161 -1.206017 1.106167
H  7.082091 -2.172328 -0.245782
H  2.010541 3.269334 1.691026
H  -4.702951 -0.448808 -0.333508
